BDBM177519 US9120749, 886
SMILES: C[C@H](N)C(=O)N[C@H]1CC[C@@H](CC1)Nc1c(cnc2ccc(cc12)-c1cc(Cl)c(O)c(Cl)c1)C(C)=O
InChI Key: InChIKey=ALANNRUBNGLOLE-KKXDTOCCSA-N
Data: 1 IC50
Activity Spreadsheet -- Enzyme Inhibition Constant Data from BindingDB
Found 1 hit for monomerid = 177519
Trg + Lig
Ki
nM
ΔG°
kcal/mole
IC50
nM
Kd
nM
EC50/IC50
nM
koff
s-1
kon
M-1s-1
pHTemp
°C
Maternal embryonic leucine zipper kinase (MELK)
(Homo sapiens (Human))
BDBM177519
(US9120749, 886)
Show SMILES C[C@H](N)C(=O)N[C@H]1CC[C@@H](CC1)Nc1c(cnc2ccc(cc12)-c1cc(Cl)c(O)c(Cl)c1)C(C)=O |r,wU:9.12,1.1,wD:6.5,(-.25,3.49,;-1.58,4.26,;-1.18,5.75,;-2.92,3.49,;-4.25,4.26,;-2.92,1.95,;-1.58,1.18,;-1.58,-.36,;-.25,-1.13,;1.08,-.36,;1.08,1.18,;-.25,1.95,;2.42,-1.13,;2.42,-2.67,;3.75,-3.44,;3.75,-4.98,;2.42,-5.75,;1.08,-4.98,;-.25,-5.75,;-1.58,-4.98,;-1.58,-3.44,;-.25,-2.67,;1.08,-3.44,;-2.92,-2.67,;-2.92,-1.13,;-4.25,-.36,;-4.25,.99,;-5.58,-1.13,;-6.92,-.36,;-5.58,-2.67,;-6.92,-3.44,;-4.25,-3.44,;5.09,-2.67,;6.42,-3.44,;5.09,-1.13,)|
Show InChI InChI=1S/C26H28Cl2N4O3/c1-13(29)26(35)32-18-6-4-17(5-7-18)31-24-19-9-15(16-10-21(27)25(34)22(28)11-16)3-8-23(19)30-12-20(24)14(2)33/h3,8-13,17-18,34H,4-7,29H2,1-2H3,(H,30,31)(H,32,35)/t13-,17-,18-/m0/s1
US Patent
n/an/a 0.660n/an/an/an/a7.425
ONCOTHERAPY SCIENCE, INC.
US Patent
Assay Description
MELK activity was determined in the presence or absence of compounds using fluorescein isothiocyanate-labeled (FITC-labeled) histone H3 peptide as a ...
US Patent US9120749 (2015)
BindingDB Entry DOI: 10.7270/Q2FX7872