BDBM177812 US9120791, Example 30::US9603854, 30
SMILES: CN1CCN(C[C@@H]2Cc3ccccc3CN2C(=O)c2ccc(Cl)cc2-c2cc(C(=O)N(c3ccc(O)cc3)c3ccc4n(C)ccc4c3)c3CCCCn23)CC1
InChI Key: InChIKey=CZUGDLVHEGFYKH-QNGWXLTQSA-N
Data: 2 IC50
Activity Spreadsheet -- Enzyme Inhibition Constant Data from BindingDB
Found 2 hits for monomerid = 177812
Trg + Lig
Ki
nM
ΔG°
kcal/mole
IC50
nM
Kd
nM
EC50/IC50
nM
koff
s-1
kon
M-1s-1
pHTemp
°C
Apoptosis regulator Bcl-2
(Homo sapiens (Human))
BDBM177812
(US9120791, Example 30 | US9603854, 30)
Show SMILES CN1CCN(C[C@@H]2Cc3ccccc3CN2C(=O)c2ccc(Cl)cc2-c2cc(C(=O)N(c3ccc(O)cc3)c3ccc4n(C)ccc4c3)c3CCCCn23)CC1
Show InChI InChI=1S/C46H47ClN6O3/c1-48-21-23-50(24-22-48)30-37-25-31-7-3-4-8-33(31)29-52(37)45(55)39-16-10-34(47)27-40(39)44-28-41(43-9-5-6-19-51(43)44)46(56)53(35-11-14-38(54)15-12-35)36-13-17-42-32(26-36)18-20-49(42)2/h3-4,7-8,10-18,20,26-28,37,54H,5-6,9,19,21-25,29-30H2,1-2H3/t37-/m0/s1
US Patent
n/an/a 13n/an/an/an/an/an/a
LES LABORATOIRES SERVIER; VERNALIS (R&D) LTD
US Patent
Assay Description
The fluorescence polarisation tests were carried out on microplates (384 wells). The Bcl-2 protein, at a final concentration of 2.50×10−8 M, is...
US Patent US9603854 (2017)
BindingDB Entry DOI: 10.7270/Q2GX4DMT
Apoptosis regulator Bcl-2
(Mus musculus (Mouse))
BDBM177812
(US9120791, Example 30 | US9603854, 30)
Show SMILES CN1CCN(C[C@@H]2Cc3ccccc3CN2C(=O)c2ccc(Cl)cc2-c2cc(C(=O)N(c3ccc(O)cc3)c3ccc4n(C)ccc4c3)c3CCCCn23)CC1
Show InChI InChI=1S/C46H47ClN6O3/c1-48-21-23-50(24-22-48)30-37-25-31-7-3-4-8-33(31)29-52(37)45(55)39-16-10-34(47)27-40(39)44-28-41(43-9-5-6-19-51(43)44)46(56)53(35-11-14-38(54)15-12-35)36-13-17-42-32(26-36)18-20-49(42)2/h3-4,7-8,10-18,20,26-28,37,54H,5-6,9,19,21-25,29-30H2,1-2H3/t37-/m0/s1
US Patent
n/an/a 13n/an/an/an/a7.4n/a
LES LABORATOIRES SERVIER; VERNALIS (R&D) LTD
US Patent
Assay Description
The fluorescence polarisation tests were carried out on microplates (384 wells). The Bcl-2 protein, at a final concentration of 2.50×10−8 M, is...
US Patent US9120791 (2015)
BindingDB Entry DOI: 10.7270/Q21N7ZWC