BDBM178163 US9120808, Example 41::US9120808, Example 42
SMILES: ICC1CC(C(=O)O1)=C1O[C@@H]2CC(=O)N2C1C(=O)OCc1ccccc1
InChI Key: InChIKey=ROBNSNBYRBBNOO-XGTXGMFGSA-N
Data: 6 IC50
Activity Spreadsheet -- Enzyme Inhibition Constant Data from BindingDB
Found 6 hits for monomerid = 178163
Trg + Lig
Ki
nM
ΔG°
kcal/mole
IC50
nM
Kd
nM
EC50/IC50
nM
koff
s-1
kon
M-1s-1
pHTemp
°C
Beta-lactamase AmpC
(Escherichia coli)
BDBM178163
(US9120808, Example 41 | US9120808, Example 42)
Show SMILES ICC1CC(C(=O)O1)=C1O[C@@H]2CC(=O)N2C1C(=O)OCc1ccccc1 |r,w:4.4|
Show InChI InChI=1S/C18H16INO6/c19-8-11-6-12(17(22)25-11)16-15(20-13(21)7-14(20)26-16)18(23)24-9-10-4-2-1-3-5-10/h1-5,11,14-15H,6-9H2/t11?,14-,15?/m1/s1
US Patent
n/an/a 285n/an/an/an/a7.037
NABRIVA THERAPEUTICS AG
US Patent
Assay Description
The inhibitory concentrations (IC50, [uM]) of the beta -lactamase inhibitors against purified TEM-1, SHV-1 and AmpC beta -lactamases are assessed by ...
US Patent US9120808 (2015)
BindingDB Entry DOI: 10.7270/Q2Q81BT5
Beta-lactamase (SHV-1)
(Escherichia coli)
BDBM178163
(US9120808, Example 41 | US9120808, Example 42)
Show SMILES ICC1CC(C(=O)O1)=C1O[C@@H]2CC(=O)N2C1C(=O)OCc1ccccc1 |r,w:4.4|
Show InChI InChI=1S/C18H16INO6/c19-8-11-6-12(17(22)25-11)16-15(20-13(21)7-14(20)26-16)18(23)24-9-10-4-2-1-3-5-10/h1-5,11,14-15H,6-9H2/t11?,14-,15?/m1/s1
US Patent
n/an/a 0.400n/an/an/an/a7.037
NABRIVA THERAPEUTICS AG
US Patent
Assay Description
The inhibitory concentrations (IC50, [uM]) of the beta -lactamase inhibitors against purified TEM-1, SHV-1 and AmpC beta -lactamases are assessed by ...
US Patent US9120808 (2015)
BindingDB Entry DOI: 10.7270/Q2Q81BT5
Beta-lactamase (TEM-1)
(Escherichia coli)
BDBM178163
(US9120808, Example 41 | US9120808, Example 42)
Show SMILES ICC1CC(C(=O)O1)=C1O[C@@H]2CC(=O)N2C1C(=O)OCc1ccccc1 |r,w:4.4|
Show InChI InChI=1S/C18H16INO6/c19-8-11-6-12(17(22)25-11)16-15(20-13(21)7-14(20)26-16)18(23)24-9-10-4-2-1-3-5-10/h1-5,11,14-15H,6-9H2/t11?,14-,15?/m1/s1
US Patent
n/an/a 1.70n/an/an/an/a7.037
NABRIVA THERAPEUTICS AG
US Patent
Assay Description
The inhibitory concentrations (IC50, [uM]) of the beta -lactamase inhibitors against purified TEM-1, SHV-1 and AmpC beta -lactamases are assessed by ...
US Patent US9120808 (2015)
BindingDB Entry DOI: 10.7270/Q2Q81BT5
Beta-lactamase AmpC
(Escherichia coli)
BDBM178163
(US9120808, Example 41 | US9120808, Example 42)
Show SMILES ICC1CC(C(=O)O1)=C1O[C@@H]2CC(=O)N2C1C(=O)OCc1ccccc1 |r,w:4.4|
Show InChI InChI=1S/C18H16INO6/c19-8-11-6-12(17(22)25-11)16-15(20-13(21)7-14(20)26-16)18(23)24-9-10-4-2-1-3-5-10/h1-5,11,14-15H,6-9H2/t11?,14-,15?/m1/s1
US Patent
n/an/a 385n/an/an/an/a7.037
NABRIVA THERAPEUTICS AG
US Patent
Assay Description
The inhibitory concentrations (IC50, [uM]) of the beta -lactamase inhibitors against purified TEM-1, SHV-1 and AmpC beta -lactamases are assessed by ...
US Patent US9120808 (2015)
BindingDB Entry DOI: 10.7270/Q2Q81BT5
Beta-lactamase (SHV-1)
(Escherichia coli)
BDBM178163
(US9120808, Example 41 | US9120808, Example 42)
Show SMILES ICC1CC(C(=O)O1)=C1O[C@@H]2CC(=O)N2C1C(=O)OCc1ccccc1 |r,w:4.4|
Show InChI InChI=1S/C18H16INO6/c19-8-11-6-12(17(22)25-11)16-15(20-13(21)7-14(20)26-16)18(23)24-9-10-4-2-1-3-5-10/h1-5,11,14-15H,6-9H2/t11?,14-,15?/m1/s1
US Patent
n/an/a 0.800n/an/an/an/a7.037
NABRIVA THERAPEUTICS AG
US Patent
Assay Description
The inhibitory concentrations (IC50, [uM]) of the beta -lactamase inhibitors against purified TEM-1, SHV-1 and AmpC beta -lactamases are assessed by ...
US Patent US9120808 (2015)
BindingDB Entry DOI: 10.7270/Q2Q81BT5
Beta-lactamase (TEM-1)
(Escherichia coli)
BDBM178163
(US9120808, Example 41 | US9120808, Example 42)
Show SMILES ICC1CC(C(=O)O1)=C1O[C@@H]2CC(=O)N2C1C(=O)OCc1ccccc1 |r,w:4.4|
Show InChI InChI=1S/C18H16INO6/c19-8-11-6-12(17(22)25-11)16-15(20-13(21)7-14(20)26-16)18(23)24-9-10-4-2-1-3-5-10/h1-5,11,14-15H,6-9H2/t11?,14-,15?/m1/s1
US Patent
n/an/a 0.200n/an/an/an/a7.037
NABRIVA THERAPEUTICS AG
US Patent
Assay Description
The inhibitory concentrations (IC50, [uM]) of the beta -lactamase inhibitors against purified TEM-1, SHV-1 and AmpC beta -lactamases are assessed by ...
US Patent US9120808 (2015)
BindingDB Entry DOI: 10.7270/Q2Q81BT5