BDBM178188 US9120808, Example 7
SMILES: OCC=CCC(C=O)=C1O[C@@H]2CC(=O)N2C1C(=O)OCc1ccccc1
InChI Key: InChIKey=PIPGAOFSHNWTAH-QGNNKKJBSA-N
Data: 3 IC50
Activity Spreadsheet -- Enzyme Inhibition Constant Data from BindingDB
Found 3 hits for monomerid = 178188
Trg + Lig
Ki
nM
ΔG°
kcal/mole
IC50
nM
Kd
nM
EC50/IC50
nM
koff
s-1
kon
M-1s-1
pHTemp
°C
Beta-lactamase
(Escherichia coli)
BDBM178188
(US9120808, Example 7)
Show SMILES OCC=CCC(C=O)=C1O[C@@H]2CC(=O)N2C1C(=O)OCc1ccccc1 |w:8.16,3.3|
Show InChI InChI=1S/C19H19NO6/c21-9-5-4-8-14(11-22)18-17(20-15(23)10-16(20)26-18)19(24)25-12-13-6-2-1-3-7-13/h1-7,11,16-17,21H,8-10,12H2/b5-4+,18-14-/t16-,17?/m1/s1
US Patent
n/an/a 5.38E+3n/an/an/an/a7.037
NABRIVA THERAPEUTICS AG
US Patent
Assay Description
The inhibitory concentrations (IC50, [uM]) of the beta -lactamase inhibitors against purified TEM-1, SHV-1 and AmpC beta -lactamases are assessed by ...
US Patent US9120808 (2015)
BindingDB Entry DOI: 10.7270/Q2Q81BT5
Beta-lactamase TEM
(Escherichia coli)
BDBM178188
(US9120808, Example 7)
Show SMILES OCC=CCC(C=O)=C1O[C@@H]2CC(=O)N2C1C(=O)OCc1ccccc1 |w:8.16,3.3|
Show InChI InChI=1S/C19H19NO6/c21-9-5-4-8-14(11-22)18-17(20-15(23)10-16(20)26-18)19(24)25-12-13-6-2-1-3-7-13/h1-7,11,16-17,21H,8-10,12H2/b5-4+,18-14-/t16-,17?/m1/s1
US Patent
n/an/a 78.4n/an/an/an/a7.037
NABRIVA THERAPEUTICS AG
US Patent
Assay Description
The inhibitory concentrations (IC50, [uM]) of the beta -lactamase inhibitors against purified TEM-1, SHV-1 and AmpC beta -lactamases are assessed by ...
US Patent US9120808 (2015)
BindingDB Entry DOI: 10.7270/Q2Q81BT5
Beta-lactamase SHV-1
(Escherichia coli)
BDBM178188
(US9120808, Example 7)
Show SMILES OCC=CCC(C=O)=C1O[C@@H]2CC(=O)N2C1C(=O)OCc1ccccc1 |w:8.16,3.3|
Show InChI InChI=1S/C19H19NO6/c21-9-5-4-8-14(11-22)18-17(20-15(23)10-16(20)26-18)19(24)25-12-13-6-2-1-3-7-13/h1-7,11,16-17,21H,8-10,12H2/b5-4+,18-14-/t16-,17?/m1/s1
US Patent
n/an/a 217n/an/an/an/a7.037
NABRIVA THERAPEUTICS AG
US Patent
Assay Description
The inhibitory concentrations (IC50, [uM]) of the beta -lactamase inhibitors against purified TEM-1, SHV-1 and AmpC beta -lactamases are assessed by ...
US Patent US9120808 (2015)
BindingDB Entry DOI: 10.7270/Q2Q81BT5