null
SMILES: Fc1cccc(c1)-c1ncc(cn1)-c1cnc([nH]1)-c1cccnc1
InChI Key: InChIKey=ATIJGZNOVFHFBW-UHFFFAOYSA-N
Activity Spreadsheet -- Enzyme Inhibition Constant Data from BindingDB
Found 2 hits for monomerid = 179409
Trg + Lig
Ki
nM
ΔG°
kcal/mole
IC50
nM
Kd
nM
EC50/IC50
nM
koff
s-1
kon
M-1s-1
pHTemp
°C
Hematopoietic prostaglandin D synthase
(Homo sapiens (Human))
BDBM179409
(US9126973, 11)
Show SMILES Fc1cccc(c1)-c1ncc(cn1)-c1cnc([nH]1)-c1cccnc1
Show InChI InChI=1S/C18H12FN5/c19-15-5-1-3-12(7-15)17-21-9-14(10-22-17)16-11-23-18(24-16)13-4-2-6-20-8-13/h1-11H,(H,23,24)
Reactome pathway
US Patent
n/an/a 41n/an/an/an/a8.025
CAYMAN CHEMICAL COMPANY, INCORPORATED
US Patent
Assay Description
The assay is carried out by the following steps: 1. Inhibitor screening is performed in 100 mM Tris-HCl, pH 8.0 containing 1 mM GSH, 1 mM MgCl.sub.2,...
US Patent US9126973 (2015)
BindingDB Entry DOI: 10.7270/Q2930RZ3
Hematopoietic prostaglandin D synthase
(Homo sapiens (Human))
BDBM179409
(US9126973, 11)
Show SMILES Fc1cccc(c1)-c1ncc(cn1)-c1cnc([nH]1)-c1cccnc1
Show InChI InChI=1S/C18H12FN5/c19-15-5-1-3-12(7-15)17-21-9-14(10-22-17)16-11-23-18(24-16)13-4-2-6-20-8-13/h1-11H,(H,23,24)
Reactome pathway
US Patent
n/an/a 156n/an/an/an/an/a25
CAYMAN CHEMICAL COMPANY, INCORPORATED
US Patent
Assay Description
This assay essentially is available from Cayman Chemical Company as Catalog item #600007. The test data reported for the aforementioned Examples (H-P...
US Patent US9126973 (2015)
BindingDB Entry DOI: 10.7270/Q2930RZ3