BDBM179702 US9127001, 8i::US9598410, Compound 8i
SMILES: Fc1ccc(Cn2nc(c3CN(CCc23)C(=O)C2CCC2)-c2cccc(c2)C#N)c(F)c1
InChI Key: InChIKey=BRXGHBYVWGZKBS-UHFFFAOYSA-N
Data: 2 IC50
Activity Spreadsheet -- Enzyme Inhibition Constant Data from BindingDB
Found 2 hits for monomerid = 179702
Trg + Lig
Ki
nM
ΔG°
kcal/mole
IC50
nM
Kd
nM
EC50/IC50
nM
koff
s-1
kon
M-1s-1
pHTemp
°C
Potassium channel subfamily K member 3
(Homo sapiens (Human))
BDBM179702
(US9127001, 8i | US9598410, Compound 8i)
Show SMILES Fc1ccc(Cn2nc(c3CN(CCc23)C(=O)C2CCC2)-c2cccc(c2)C#N)c(F)c1
Show InChI InChI=1S/C25H22F2N4O/c26-20-8-7-19(22(27)12-20)14-31-23-9-10-30(25(32)17-4-2-5-17)15-21(23)24(29-31)18-6-1-3-16(11-18)13-28/h1,3,6-8,11-12,17H,2,4-5,9-10,14-15H2
US Patent
n/an/a 64n/an/an/an/an/an/a
SANOFI
US Patent
Assay Description
Human TASK-1 channels were expressed in Xenopus oocytes. For this purpose, oocytes were isolated from Xenopus laevis and defoliated. Subsequently, TA...
US Patent US9598410 (2017)
BindingDB Entry DOI: 10.7270/Q2377BRM
Potassium channel subfamily K member 3
(Homo sapiens (Human))
BDBM179702
(US9127001, 8i | US9598410, Compound 8i)
Show SMILES Fc1ccc(Cn2nc(c3CN(CCc23)C(=O)C2CCC2)-c2cccc(c2)C#N)c(F)c1
Show InChI InChI=1S/C25H22F2N4O/c26-20-8-7-19(22(27)12-20)14-31-23-9-10-30(25(32)17-4-2-5-17)15-21(23)24(29-31)18-6-1-3-16(11-18)13-28/h1,3,6-8,11-12,17H,2,4-5,9-10,14-15H2
US Patent
n/an/a 64n/an/an/an/an/a25
Sanofi
US Patent
Assay Description
Human TASK-1 channels were expressed in Xenopus oocytes. For this purpose, oocytes were isolated from Xenopus laevis and defoliculated. Subsequently,...
US Patent US9127001 (2015)
BindingDB Entry DOI: 10.7270/Q2HM576Z