null
SMILES: COc1ccc(Cl)c(c1)-c1ccc(cn1)[C@H]1C[C@@H]1N
InChI Key: InChIKey=DUVYQDFYLCQFQF-RISCZKNCSA-N
Activity Spreadsheet -- Enzyme Inhibition Constant Data from BindingDB
Found 3 hits for monomerid = 179717
Trg + Lig
Ki
nM
ΔG°
kcal/mole
IC50
nM
Kd
nM
EC50/IC50
nM
koff
s-1
kon
M-1s-1
pHTemp
°C
Lysine-specific histone demethylase 1A
(Homo sapiens (Human))
BDBM179717
(US9676701, 43 (trans)-2-(6-(2-chloro-5-methoxyphen...)
Show SMILES COc1ccc(Cl)c(c1)-c1ccc(cn1)[C@H]1C[C@@H]1N |r|
Show InChI InChI=1S/C15H15ClN2O/c1-19-10-3-4-13(16)12(6-10)15-5-2-9(8-18-15)11-7-14(11)17/h2-6,8,11,14H,7,17H2,1H3/t11-,14+/m1/s1
Reactome pathway
US Patent
550 -8.53n/an/an/an/an/a7.425
ORYZON GENOMICS, S.A.
US Patent
Assay Description
Briefly, a fixed amount of LSD1 was incubated on ice for 15 minutes, in the absence and/or in the presence of various concentrations of inhibitor (e....
US Patent US9676701 (2017)
BindingDB Entry DOI: 10.7270/Q27P8WJN
Amine oxidase [flavin-containing] A
(Homo sapiens (Human))
BDBM179717
(US9676701, 43 (trans)-2-(6-(2-chloro-5-methoxyphen...)
Show SMILES COc1ccc(Cl)c(c1)-c1ccc(cn1)[C@H]1C[C@@H]1N |r|
Show InChI InChI=1S/C15H15ClN2O/c1-19-10-3-4-13(16)12(6-10)15-5-2-9(8-18-15)11-7-14(11)17/h2-6,8,11,14H,7,17H2,1H3/t11-,14+/m1/s1
US Patent
>1.00E+3n/an/an/an/an/an/a7.5n/a
ORYZON GENOMICS, S.A.
US Patent
Assay Description
Assays were conducted in 96-well black plates with clear bottom (Corning) in a final volume of 100 μL. The assay buffer was 100 mM HEPES, pH 7.5...
US Patent US9676701 (2017)
BindingDB Entry DOI: 10.7270/Q27P8WJN
Amine oxidase [flavin-containing] B
(Homo sapiens (Human))
BDBM179717
(US9676701, 43 (trans)-2-(6-(2-chloro-5-methoxyphen...)
Show SMILES COc1ccc(Cl)c(c1)-c1ccc(cn1)[C@H]1C[C@@H]1N |r|
Show InChI InChI=1S/C15H15ClN2O/c1-19-10-3-4-13(16)12(6-10)15-5-2-9(8-18-15)11-7-14(11)17/h2-6,8,11,14H,7,17H2,1H3/t11-,14+/m1/s1
US Patent
>1.00E+3n/an/an/an/an/an/a7.5n/a
ORYZON GENOMICS, S.A.
US Patent
Assay Description
Assays were conducted in 96-well black plates with clear bottom (Corning) in a final volume of 100 μL. The assay buffer was 100 mM HEPES, pH 7.5...
US Patent US9676701 (2017)
BindingDB Entry DOI: 10.7270/Q27P8WJN