BDBM179821 US9132129, Cpd002
SMILES: Cc1ccc(cc1)-c1c(C(OC(C)(C)C)C(O)=O)c(C)nc2cc3CCCCc3cc12
InChI Key: InChIKey=NWMYEMJIPIXUNW-UHFFFAOYSA-N
Data: 1 IC50
Activity Spreadsheet -- Enzyme Inhibition Constant Data from BindingDB
Found 1 hit for monomerid = 179821
Trg + Lig
Ki
nM
ΔG°
kcal/mole
IC50
nM
Kd
nM
EC50/IC50
nM
koff
s-1
kon
M-1s-1
pHTemp
°C
lens epithelium-derived growth factor p75
(Homo sapiens (Human))
BDBM179821
(US9132129, Cpd002)
Show SMILES Cc1ccc(cc1)-c1c(C(OC(C)(C)C)C(O)=O)c(C)nc2cc3CCCCc3cc12
Show InChI InChI=1S/C27H31NO3/c1-16-10-12-18(13-11-16)24-21-14-19-8-6-7-9-20(19)15-22(21)28-17(2)23(24)25(26(29)30)31-27(3,4)5/h10-15,25H,6-9H2,1-5H3,(H,29,30)
Reactome pathway
US Patent
n/an/a 550n/an/an/an/a7.025
KATHOLIEKE UNIVERSITEIT LEUVEN
US Patent
Assay Description
An Homogeneous Time Resolved Fluorescence (HTRF) assay was performed in a manner similar to previous reports on HTRF protein protein assays as review...
US Patent US9132129 (2015)
BindingDB Entry DOI: 10.7270/Q2MC8XSH