BDBM179995 US9676720, Example 7
SMILES: CCOc1cccc(c1)-c1ccc(CN(Cc2cccc(NCC(O)=O)n2)S(=O)(=O)c2ccccn2)cc1
InChI Key: InChIKey=BIMLHLJOXYCJQQ-UHFFFAOYSA-N
Data: 1 KI
Activity Spreadsheet -- Enzyme Inhibition Constant Data from BindingDB
Found 1 hit for monomerid = 179995
Trg + Lig
Ki
nM
ΔG°
kcal/mole
IC50
nM
Kd
nM
EC50/IC50
nM
koff
s-1
kon
M-1s-1
pHTemp
°C
Prostaglandin E2 receptor EP2 subtype
(Homo sapiens (Human))
BDBM179995
(US9676720, Example 7)
Show SMILES CCOc1cccc(c1)-c1ccc(CN(Cc2cccc(NCC(O)=O)n2)S(=O)(=O)c2ccccn2)cc1
Show InChI InChI=1S/C28H28N4O5S/c1-2-37-25-9-5-7-23(17-25)22-14-12-21(13-15-22)19-32(38(35,36)27-11-3-4-16-29-27)20-24-8-6-10-26(31-24)30-18-28(33)34/h3-17H,2,18-20H2,1H3,(H,30,31)(H,33,34)
Reactome pathway
US Patent
0.610n/an/an/an/an/an/a6.0n/a
UBE INDUSTRIES, LTD.
US Patent
Assay Description
Measurement of EP2 receptor binding action was performed in accordance with the method of Abramovitz et al. (Biochimica et Biophysica Acta, 1483, 285...
US Patent US9676720 (2017)
BindingDB Entry DOI: 10.7270/Q2057D39