BDBM180000 US9676720, Example 14
SMILES: CC#Cc1cccc(c1)-c1ccc(CN(Cc2cccc(NCC(O)=O)n2)S(=O)(=O)c2cccs2)cc1
InChI Key: InChIKey=NNMVGFQTIKJWHV-UHFFFAOYSA-N
Data: 1 KI
Activity Spreadsheet -- Enzyme Inhibition Constant Data from BindingDB
Found 1 hit for monomerid = 180000
Trg + Lig
Ki
nM
ΔG°
kcal/mole
IC50
nM
Kd
nM
EC50/IC50
nM
koff
s-1
kon
M-1s-1
pHTemp
°C
Prostaglandin E2 receptor EP2 subtype
(Homo sapiens (Human))
BDBM180000
(US9676720, Example 14)
Show SMILES CC#Cc1cccc(c1)-c1ccc(CN(Cc2cccc(NCC(O)=O)n2)S(=O)(=O)c2cccs2)cc1
Show InChI InChI=1S/C28H25N3O4S2/c1-2-6-21-7-3-8-24(17-21)23-14-12-22(13-15-23)19-31(37(34,35)28-11-5-16-36-28)20-25-9-4-10-26(30-25)29-18-27(32)33/h3-5,7-17H,18-20H2,1H3,(H,29,30)(H,32,33)
Reactome pathway
US Patent
0.900n/an/an/an/an/an/a6.0n/a
UBE INDUSTRIES, LTD.
US Patent
Assay Description
Measurement of EP2 receptor binding action was performed in accordance with the method of Abramovitz et al. (Biochimica et Biophysica Acta, 1483, 285...
US Patent US9676720 (2017)
BindingDB Entry DOI: 10.7270/Q2057D39