BDBM180005 US9676720, Comparative example 1
SMILES: OC(=O)CNc1cccc(CN(Cc2ccc(cc2)-c2ccccc2)S(=O)(=O)c2ccccn2)n1
InChI Key: InChIKey=FOQPCHCFVSFJFJ-UHFFFAOYSA-N
Data: 1 KI
Activity Spreadsheet -- Enzyme Inhibition Constant Data from BindingDB
Found 1 hit for monomerid = 180005
Trg + Lig
Ki
nM
ΔG°
kcal/mole
IC50
nM
Kd
nM
EC50/IC50
nM
koff
s-1
kon
M-1s-1
pHTemp
°C
Prostaglandin E2 receptor EP2 subtype
(Homo sapiens (Human))
BDBM180005
(US9676720, Comparative example 1)
Show SMILES OC(=O)CNc1cccc(CN(Cc2ccc(cc2)-c2ccccc2)S(=O)(=O)c2ccccn2)n1
Show InChI InChI=1S/C26H24N4O4S/c31-26(32)17-28-24-10-6-9-23(29-24)19-30(35(33,34)25-11-4-5-16-27-25)18-20-12-14-22(15-13-20)21-7-2-1-3-8-21/h1-16H,17-19H2,(H,28,29)(H,31,32)
Reactome pathway
US Patent
1.5n/an/an/an/an/an/a6.0n/a
UBE INDUSTRIES, LTD.
US Patent
Assay Description
Measurement of EP2 receptor binding action was performed in accordance with the method of Abramovitz et al. (Biochimica et Biophysica Acta, 1483, 285...
US Patent US9676720 (2017)
BindingDB Entry DOI: 10.7270/Q2057D39