null
SMILES: CN(C)S(=O)(=O)c1cccc(c1)S(=O)(=O)c1ccc(CNC(Nc2ccncc2)=NC#N)cc1
InChI Key: InChIKey=NAKQLVMQWLONBV-UHFFFAOYSA-N
Activity Spreadsheet -- Enzyme Inhibition Constant Data from BindingDB
Found 1 hit for monomerid = 180064
Trg + Lig
Ki
nM
ΔG°
kcal/mole
IC50
nM
Kd
nM
EC50/IC50
nM
koff
s-1
kon
M-1s-1
pHTemp
°C
Nicotinamide phosphoribosyltransferase
(Homo sapiens (Human))
BDBM180064
(US9676721, 64 2-cyano-1-[(4-{[3-(dimethylsulfamoyl...)
Show SMILES CN(C)S(=O)(=O)c1cccc(c1)S(=O)(=O)c1ccc(CNC(Nc2ccncc2)=NC#N)cc1 |w:29.31|
Show InChI InChI=1S/C22H22N6O4S2/c1-28(2)34(31,32)21-5-3-4-20(14-21)33(29,30)19-8-6-17(7-9-19)15-25-22(26-16-23)27-18-10-12-24-13-11-18/h3-14H,15H2,1-2H3,(H2,24,25,26,27)
Reactome pathway
US Patent
n/an/a 1.30n/an/an/an/a7.525
FORMA TM, LLC
US Patent
Assay Description
The NAMPT enzymatic reactions were carried out in Buffer A (50 mM Hepes pH 7.5, 50 mM NaCl, 5 mM MgCl2, and 1 mM THP) in 96-well V-bottom plates. The...
US Patent US9676721 (2017)
BindingDB Entry DOI: 10.7270/Q2VD6WMM