null
SMILES: COC(=O)N[C@@H](C(c1ccccc1)c1ccccc1)C(=O)N[C@H](c1ccc(s1)[C@@H](CO)N(CCC(C)C)S(=O)(=O)c1ccc(N)cc1)C(F)(F)F
InChI Key: InChIKey=ACSDFEORAUBYGU-ZSUPJWAMSA-N
Activity Spreadsheet -- Enzyme Inhibition Constant Data from BindingDB
Found 1 hit for monomerid = 180201
Trg + Lig
Ki
nM
ΔG°
kcal/mole
IC50
nM
Kd
nM
EC50/IC50
nM
koff
s-1
kon
M-1s-1
pHTemp
°C
Gag-Pol polyprotein
(Human immunodeficiency virus type 1 group M subtyp...)
BDBM180201
(US9133157, 83)
Show SMILES COC(=O)N[C@@H](C(c1ccccc1)c1ccccc1)C(=O)N[C@H](c1ccc(s1)[C@@H](CO)N(CCC(C)C)S(=O)(=O)c1ccc(N)cc1)C(F)(F)F |r|
Show InChI InChI=1S/C36H41F3N4O6S2/c1-23(2)20-21-43(51(47,48)27-16-14-26(40)15-17-27)28(22-44)29-18-19-30(50-29)33(36(37,38)39)42-34(45)32(41-35(46)49-3)31(24-10-6-4-7-11-24)25-12-8-5-9-13-25/h4-19,23,28,31-33,44H,20-22,40H2,1-3H3,(H,41,46)(H,42,45)/t28-,32+,33-/m1/s1
US Patent
n/an/a 0.300n/an/an/an/a5.525
Merck Canada Inc.
US Patent
Assay Description
The inhibition of WT HIV-1 protease was studied using the reaction of the protease (expressed in Eschericia coli) with a peptide substrate [Val-Ser-G...
US Patent US9133157 (2015)
BindingDB Entry DOI: 10.7270/Q2Q52NDV