BDBM18032 Ketopiperazine-based inhibitor, 12
SMILES: COCCCN1C(=O)COc2ccc(OC[C@H]3CNCC(=O)N3c3ccc(OCCCOCc4ccccc4OC)cc3)cc12
InChI Key: InChIKey=WKNXTOXSVTVKNH-HHHXNRCGSA-N
Data: 1 IC50
Activity Spreadsheet -- Enzyme Inhibition Constant Data from BindingDB
Found 1 hit for monomerid = 18032
Trg + Lig
Ki
nM
ΔG°
kcal/mole
IC50
nM
Kd
nM
EC50/IC50
nM
koff
s-1
kon
M-1s-1
pHTemp
°C
Renin
(Homo sapiens (Human))
BDBM18032
(Ketopiperazine-based inhibitor, 12)
Show SMILES COCCCN1C(=O)COc2ccc(OC[C@H]3CNCC(=O)N3c3ccc(OCCCOCc4ccccc4OC)cc3)cc12 |r|
Show InChI InChI=1S/C34H41N3O8/c1-40-16-5-15-36-30-19-29(13-14-32(30)45-24-34(36)39)44-23-27-20-35-21-33(38)37(27)26-9-11-28(12-10-26)43-18-6-17-42-22-25-7-3-4-8-31(25)41-2/h3-4,7-14,19,27,35H,5-6,15-18,20-24H2,1-2H3/t27-/m1/s1
Reactome pathway
n/an/a 0.680n/an/an/an/a7.422
Pfizer
Assay Description
The renin assay utilized a tandem Green Flourescent Protein (tGFP) substrate that was hydrolyzed by human rennin. The tGFP substrate contained a nine...
Bioorg Med Chem Lett 16: 2500-4 (2006)
Article DOI: 10.1016/j.bmcl.2006.01.084
BindingDB Entry DOI: 10.7270/Q26D5R7R