BDBM18068 2-amino-6-(methylamino)-5-nitropyrimidin-4-ol::CHEMBL56190::MANIC, 3
SMILES: CNc1nc(N)[nH]c(=O)c1[N+]([O-])=O
InChI Key: InChIKey=NMCMUSAXKISTKW-UHFFFAOYSA-N
Data: 2 IC50
PDB links: 1 PDB ID matches this monomer.
Activity Spreadsheet -- Enzyme Inhibition Constant Data from BindingDB
Found 2 hits for monomerid = 18068
Trg + Lig
Ki
nM
ΔG°
kcal/mole
IC50
nM
Kd
nM
EC50/IC50
nM
koff
s-1
kon
M-1s-1
pHTemp
°C
Bacterial dihydropteroate synthase
(Escherichia coli (strain K12))
BDBM18068
(2-amino-6-(methylamino)-5-nitropyrimidin-4-ol | CH...)
Show SMILES CNc1nc(N)[nH]c(=O)c1[N+]([O-])=O
Show InChI InChI=1S/C5H7N5O3/c1-7-3-2(10(12)13)4(11)9-5(6)8-3/h1H3,(H4,6,7,8,9,11)
n/an/a 2.80E+3n/an/an/an/an/an/a
TBA
Curated by ChEMBL
Assay Description
In vitro inhibition of dihydropteroate synthase from Escherichia coli.
J Med Chem 28: 1870-4 (1986)
BindingDB Entry DOI: 10.7270/Q2542PRF
Dihydrofolate Reductase (DHFR)
(Bacillus anthracis)
BDBM18068
(2-amino-6-(methylamino)-5-nitropyrimidin-4-ol | CH...)
Show SMILES CNc1nc(N)[nH]c(=O)c1[N+]([O-])=O
Show InChI InChI=1S/C5H7N5O3/c1-7-3-2(10(12)13)4(11)9-5(6)8-3/h1H3,(H4,6,7,8,9,11)
n/an/a 1.04E+5n/an/an/an/a7.122
University of Tennessee at Knoxville
Assay Description
Activity was measured as a change in absorbance over time at a wavelength of 340 nm (A340), so as to monitor the disappearance of NADPH. After incuba...
J Med Chem 50: 4374-81 (2007)
Article DOI: 10.1021/jm070319v
BindingDB Entry DOI: 10.7270/Q2PG1Q0Q