null
SMILES: CC1(C)CN(CCN1)c1ccc(cc1)-c1oc(nc1C(N)=O)-c1cccc2[nH]ccc12
InChI Key: InChIKey=YFLNJIAXYKROBA-UHFFFAOYSA-N
Activity Spreadsheet -- Enzyme Inhibition Constant Data from BindingDB
Found 3 hits for monomerid = 180870
Trg + Lig
Ki
nM
ΔG°
kcal/mole
IC50
nM
Kd
nM
EC50/IC50
nM
koff
s-1
kon
M-1s-1
pHTemp
°C
Aurora kinase A
(Homo sapiens (Human))
BDBM180870
(US9133180, 11)
Show SMILES CC1(C)CN(CCN1)c1ccc(cc1)-c1oc(nc1C(N)=O)-c1cccc2[nH]ccc12
Show InChI InChI=1S/C24H25N5O2/c1-24(2)14-29(13-12-27-24)16-8-6-15(7-9-16)21-20(22(25)30)28-23(31-21)18-4-3-5-19-17(18)10-11-26-19/h3-11,26-27H,12-14H2,1-2H3,(H2,25,30)
NCI pathway
Reactome pathway
US Patent
n/an/a 46.3n/an/an/an/a7.525
SAREUM LIMITED
US Patent
Assay Description
Kinase assays were performed at Reaction Biology Corp., Malvern, Pa., USA, using the following general procedure:1) Prepare indicated substrate in fr...
US Patent US9133180 (2015)
BindingDB Entry DOI: 10.7270/Q2P55M9X
Receptor-type tyrosine-protein kinase FLT3
(Homo sapiens (Human))
BDBM180870
(US9133180, 11)
Show SMILES CC1(C)CN(CCN1)c1ccc(cc1)-c1oc(nc1C(N)=O)-c1cccc2[nH]ccc12
Show InChI InChI=1S/C24H25N5O2/c1-24(2)14-29(13-12-27-24)16-8-6-15(7-9-16)21-20(22(25)30)28-23(31-21)18-4-3-5-19-17(18)10-11-26-19/h3-11,26-27H,12-14H2,1-2H3,(H2,25,30)
US Patent
n/an/a 1.54n/an/an/an/a7.525
SAREUM LIMITED
US Patent
Assay Description
Kinase assays were performed at Reaction Biology Corp., Malvern, Pa., USA, using the following general procedure:1) Prepare indicated substrate in fr...
US Patent US9133180 (2015)
BindingDB Entry DOI: 10.7270/Q2P55M9X
Aurora kinase B
(Homo sapiens (Human))
BDBM180870
(US9133180, 11)
Show SMILES CC1(C)CN(CCN1)c1ccc(cc1)-c1oc(nc1C(N)=O)-c1cccc2[nH]ccc12
Show InChI InChI=1S/C24H25N5O2/c1-24(2)14-29(13-12-27-24)16-8-6-15(7-9-16)21-20(22(25)30)28-23(31-21)18-4-3-5-19-17(18)10-11-26-19/h3-11,26-27H,12-14H2,1-2H3,(H2,25,30)
Reactome pathway
US Patent
n/an/a 15.2n/an/an/an/a7.525
SAREUM LIMITED
US Patent
Assay Description
Kinase assays were performed at Reaction Biology Corp., Malvern, Pa., USA, using the following general procedure:1) Prepare indicated substrate in fr...
US Patent US9133180 (2015)
BindingDB Entry DOI: 10.7270/Q2P55M9X