BDBM180871 US9133180, 12
SMILES: CC1(C)CN(CCN1)c1ccc(cc1)-c1oc(nc1C(N)=O)-c1ccc(c2[nH]ccc12)C(F)(F)F
InChI Key: InChIKey=IZDBEJJRNUSRIU-UHFFFAOYSA-N
Data: 3 IC50
Activity Spreadsheet -- Enzyme Inhibition Constant Data from BindingDB
Found 3 hits for monomerid = 180871
Trg + Lig
Ki
nM
ΔG°
kcal/mole
IC50
nM
Kd
nM
EC50/IC50
nM
koff
s-1
kon
M-1s-1
pHTemp
°C
Aurora kinase A
(Homo sapiens (Human))
BDBM180871
(US9133180, 12)
Show SMILES CC1(C)CN(CCN1)c1ccc(cc1)-c1oc(nc1C(N)=O)-c1ccc(c2[nH]ccc12)C(F)(F)F
Show InChI InChI=1S/C25H24F3N5O2/c1-24(2)13-33(12-11-31-24)15-5-3-14(4-6-15)21-20(22(29)34)32-23(35-21)17-7-8-18(25(26,27)28)19-16(17)9-10-30-19/h3-10,30-31H,11-13H2,1-2H3,(H2,29,34)
NCI pathway
Reactome pathway
US Patent
n/an/a 16n/an/an/an/a7.525
SAREUM LIMITED
US Patent
Assay Description
Kinase assays were performed at Reaction Biology Corp., Malvern, Pa., USA, using the following general procedure:1) Prepare indicated substrate in fr...
US Patent US9133180 (2015)
BindingDB Entry DOI: 10.7270/Q2P55M9X
Receptor-type tyrosine-protein kinase FLT3
(Homo sapiens (Human))
BDBM180871
(US9133180, 12)
Show SMILES CC1(C)CN(CCN1)c1ccc(cc1)-c1oc(nc1C(N)=O)-c1ccc(c2[nH]ccc12)C(F)(F)F
Show InChI InChI=1S/C25H24F3N5O2/c1-24(2)13-33(12-11-31-24)15-5-3-14(4-6-15)21-20(22(29)34)32-23(35-21)17-7-8-18(25(26,27)28)19-16(17)9-10-30-19/h3-10,30-31H,11-13H2,1-2H3,(H2,29,34)
US Patent
n/an/a 2.80n/an/an/an/a7.525
SAREUM LIMITED
US Patent
Assay Description
Kinase assays were performed at Reaction Biology Corp., Malvern, Pa., USA, using the following general procedure:1) Prepare indicated substrate in fr...
US Patent US9133180 (2015)
BindingDB Entry DOI: 10.7270/Q2P55M9X
Aurora kinase B
(Homo sapiens (Human))
BDBM180871
(US9133180, 12)
Show SMILES CC1(C)CN(CCN1)c1ccc(cc1)-c1oc(nc1C(N)=O)-c1ccc(c2[nH]ccc12)C(F)(F)F
Show InChI InChI=1S/C25H24F3N5O2/c1-24(2)13-33(12-11-31-24)15-5-3-14(4-6-15)21-20(22(29)34)32-23(35-21)17-7-8-18(25(26,27)28)19-16(17)9-10-30-19/h3-10,30-31H,11-13H2,1-2H3,(H2,29,34)
Reactome pathway
US Patent
n/an/a 14n/an/an/an/a7.525
SAREUM LIMITED
US Patent
Assay Description
Kinase assays were performed at Reaction Biology Corp., Malvern, Pa., USA, using the following general procedure:1) Prepare indicated substrate in fr...
US Patent US9133180 (2015)
BindingDB Entry DOI: 10.7270/Q2P55M9X