null
SMILES: Cn1cc(cn1)-c1cc(Oc2ccc(NC(=O)N3CCN(C4CCOCC4)C3=O)nc2)ccn1
InChI Key: InChIKey=GBBAOXPAINQYPS-UHFFFAOYSA-N
Activity Spreadsheet -- Enzyme Inhibition Constant Data from BindingDB
Found 3 hits for monomerid = 181018
Trg + Lig
Ki
nM
ΔG°
kcal/mole
IC50
nM
Kd
nM
EC50/IC50
nM
koff
s-1
kon
M-1s-1
pHTemp
°C
Macrophage colony-stimulating factor 1 receptor [538-972]
(Homo sapiens (Human))
BDBM181018
(US9133183, Example 1)
Show SMILES Cn1cc(cn1)-c1cc(Oc2ccc(NC(=O)N3CCN(C4CCOCC4)C3=O)nc2)ccn1
Show InChI InChI=1S/C23H25N7O4/c1-28-15-16(13-26-28)20-12-18(4-7-24-20)34-19-2-3-21(25-14-19)27-22(31)30-9-8-29(23(30)32)17-5-10-33-11-6-17/h2-4,7,12-15,17H,5-6,8-11H2,1H3,(H,25,27,31)
US Patent
n/an/a 6n/an/an/an/a7.530
Deciphera Pharmaceuticals, LLC
US Patent
Assay Description
Activity of unphosphorylated c-FMS kinase (uFMS, Seq. ID no. 1) was determined by following the production of ADP from the FMS kinase reaction with A...
US Patent US9133183 (2015)
BindingDB Entry DOI: 10.7270/Q2DN43TD
Vascular endothelial growth factor receptor 2
(Homo sapiens (Human))
BDBM181018
(US9133183, Example 1)
Show SMILES Cn1cc(cn1)-c1cc(Oc2ccc(NC(=O)N3CCN(C4CCOCC4)C3=O)nc2)ccn1
Show InChI InChI=1S/C23H25N7O4/c1-28-15-16(13-26-28)20-12-18(4-7-24-20)34-19-2-3-21(25-14-19)27-22(31)30-9-8-29(23(30)32)17-5-10-33-11-6-17/h2-4,7,12-15,17H,5-6,8-11H2,1H3,(H,25,27,31)
NCI pathway
Reactome pathway
US Patent
n/an/a>3.30E+3n/an/an/an/an/a27
Deciphera Pharmaceuticals, LLC
US Patent
Assay Description
These tests measure the ability of compounds to inhibit the enzymatic activity of recombinant human c-Met/HGF receptor and VEGF receptor enzymatic ac...
US Patent US9133183 (2015)
BindingDB Entry DOI: 10.7270/Q2DN43TD
Hepatocyte growth factor receptor
(Homo sapiens (Human))
BDBM181018
(US9133183, Example 1)
Show SMILES Cn1cc(cn1)-c1cc(Oc2ccc(NC(=O)N3CCN(C4CCOCC4)C3=O)nc2)ccn1
Show InChI InChI=1S/C23H25N7O4/c1-28-15-16(13-26-28)20-12-18(4-7-24-20)34-19-2-3-21(25-14-19)27-22(31)30-9-8-29(23(30)32)17-5-10-33-11-6-17/h2-4,7,12-15,17H,5-6,8-11H2,1H3,(H,25,27,31)
US Patent
n/an/a>5.00E+3n/an/an/an/an/a27
Deciphera Pharmaceuticals, LLC
US Patent
Assay Description
These tests measure the ability of compounds to inhibit the enzymatic activity of recombinant human c-Met/HGF receptor and VEGF receptor enzymatic ac...
US Patent US9133183 (2015)
BindingDB Entry DOI: 10.7270/Q2DN43TD