BDBM181064 (E)-N'-(5-Chloro-2-hydroxybenzylidene)-4-(2-oxo-2Hchromen-3-yl)thiazole-2-carbohydrazide (7h)
SMILES: Oc1ccc(Cl)cc1\C=N\NC(=O)c1nc(cs1)-c1cc2ccccc2oc1=O
InChI Key: InChIKey=CSNPUNUNGVTJMF-LSFURLLWSA-N
Data: 2 IC50
Activity Spreadsheet -- Enzyme Inhibition Constant Data from BindingDB
Found 2 hits for monomerid = 181064
Trg + Lig
Ki
nM
ΔG°
kcal/mole
IC50
nM
Kd
nM
EC50/IC50
nM
koff
s-1
kon
M-1s-1
pHTemp
°C
Probable maltase-glucoamylase 2
(Homo sapiens)
BDBM181064
((E)-N'-(5-Chloro-2-hydroxybenzylidene)-4-(2-ox...)
Show SMILES Oc1ccc(Cl)cc1\C=N\NC(=O)c1nc(cs1)-c1cc2ccccc2oc1=O
Show InChI InChI=1S/C20H12ClN3O4S/c21-13-5-6-16(25)12(7-13)9-22-24-18(26)19-23-15(10-29-19)14-8-11-3-1-2-4-17(11)28-20(14)27/h1-10,25H,(H,24,26)/b22-9+
n/an/a 6.20E+3n/an/an/an/an/an/a
Babasaheb Bhimrao Ambedkar University (A Central University)
Curated by ChEMBL
Assay Description
Inhibition of alpha-glucosidase (unknown origin) using p-nitro phenyl glucopyranoside as substrate preincubated for 10 mins followed by substrate add...
Eur J Med Chem 176: 343-377 (2019)
Article DOI: 10.1016/j.ejmech.2019.04.025
Alpha-glucosidase MAL12
(Saccharomyces cerevisiae)
BDBM181064
((E)-N'-(5-Chloro-2-hydroxybenzylidene)-4-(2-ox...)
Show SMILES Oc1ccc(Cl)cc1\C=N\NC(=O)c1nc(cs1)-c1cc2ccccc2oc1=O
Show InChI InChI=1S/C20H12ClN3O4S/c21-13-5-6-16(25)12(7-13)9-22-24-18(26)19-23-15(10-29-19)14-8-11-3-1-2-4-17(11)28-20(14)27/h1-10,25H,(H,24,26)/b22-9+
Reactome pathway
n/an/a 8.23E+3n/an/an/an/a6.8n/a
Jishou University
Assay Description
The test compounds were dissolved in DMSO to prepare the required distributing concentration. α-Glucosidase inhibitory activity was assayed by u...
Bioorg Chem 65: 167-74 (2016)
Article DOI: 10.1016/j.bioorg.2016.03.001
BindingDB Entry DOI: 10.7270/Q2445K8R