BDBM181136 US9138393, 2-Ethylimidazole::US9144538, 2-Ethylimidazole
SMILES: CCc1ncc[nH]1
InChI Key: InChIKey=PQAMFDRRWURCFQ-UHFFFAOYSA-N
Data: 2 IC50
PDB links: 1 PDB ID matches this monomer.
Activity Spreadsheet -- Enzyme Inhibition Constant Data from BindingDB
Found 2 hits for monomerid = 181136
Trg + Lig
Ki
nM
ΔG°
kcal/mole
IC50
nM
Kd
nM
EC50/IC50
nM
koff
s-1
kon
M-1s-1
pHTemp
°C
Cytochrome P450 3A4
(Homo sapiens (Human))
BDBM181136
(US9138393, 2-Ethylimidazole | US9144538, 2-Ethylim...)
Show SMILES CCc1ncc[nH]1
Show InChI InChI=1S/C5H8N2/c1-2-5-6-3-4-7-5/h3-4H,2H2,1H3,(H,6,7)
Reactome pathway
US Patent
n/an/a>1.00E+4n/an/an/an/an/an/a
The Procter & Gamble Company
US Patent
Assay Description
Cytochrome P450 is a large and diverse group of enzymes that catalyze the oxidation of organic substances. Some members of the CYP family contribute ...
US Patent US9144538 (2015)
BindingDB Entry DOI: 10.7270/Q22806DV
Cytochrome P450 3A4
(Homo sapiens (Human))
BDBM181136
(US9138393, 2-Ethylimidazole | US9144538, 2-Ethylim...)
Show SMILES CCc1ncc[nH]1
Show InChI InChI=1S/C5H8N2/c1-2-5-6-3-4-7-5/h3-4H,2H2,1H3,(H,6,7)
Reactome pathway
US Patent
n/an/a>1.00E+4n/an/an/an/an/an/a
The Procter & Gamble Company
US Patent
Assay Description
A commercially available P450-GLO Assay kit (Promega Corporation, Madison Wis.) is used to screen various compounds for CYP3A4A inhibition activity. ...
US Patent US9138393 (2015)
BindingDB Entry DOI: 10.7270/Q2GF0S8J