BDBM181137 US9138393, L-Asparigine::US9144538, L-Asparigine
SMILES: N[C@@H](CC(N)=O)C(O)=O
InChI Key: InChIKey=DCXYFEDJOCDNAF-REOHCLBHSA-N
Data: 2 IC50
PDB links: 28 PDB IDs match this monomer.
Activity Spreadsheet -- Enzyme Inhibition Constant Data from BindingDB
Found 2 hits for monomerid = 181137
Trg + Lig
Ki
nM
ΔG°
kcal/mole
IC50
nM
Kd
nM
EC50/IC50
nM
koff
s-1
kon
M-1s-1
pHTemp
°C
Cytochrome P450 3A4
(Homo sapiens (Human))
BDBM181137
(US9138393, L-Asparigine | US9144538, L-Asparigine)
Show SMILES N[C@@H](CC(N)=O)C(O)=O |r|
Show InChI InChI=1S/C4H8N2O3/c5-2(4(8)9)1-3(6)7/h2H,1,5H2,(H2,6,7)(H,8,9)/t2-/m0/s1
Reactome pathway
US Patent
n/an/a>1.00E+4n/an/an/an/an/an/a
The Procter & Gamble Company
US Patent
Assay Description
Cytochrome P450 is a large and diverse group of enzymes that catalyze the oxidation of organic substances. Some members of the CYP family contribute ...
US Patent US9144538 (2015)
BindingDB Entry DOI: 10.7270/Q22806DV
Cytochrome P450 3A4
(Homo sapiens (Human))
BDBM181137
(US9138393, L-Asparigine | US9144538, L-Asparigine)
Show SMILES N[C@@H](CC(N)=O)C(O)=O |r|
Show InChI InChI=1S/C4H8N2O3/c5-2(4(8)9)1-3(6)7/h2H,1,5H2,(H2,6,7)(H,8,9)/t2-/m0/s1
Reactome pathway
US Patent
n/an/a>1.00E+4n/an/an/an/an/an/a
The Procter & Gamble Company
US Patent
Assay Description
A commercially available P450-GLO Assay kit (Promega Corporation, Madison Wis.) is used to screen various compounds for CYP3A4A inhibition activity. ...
US Patent US9138393 (2015)
BindingDB Entry DOI: 10.7270/Q2GF0S8J