BDBM181223 US9139529, 66::US9783501, Compound 66
SMILES: NS(=O)(=O)c1cccc(NC(=O)c2cc3ccccc3nc2Oc2ccc(F)cc2Cl)c1
InChI Key: InChIKey=KKPMVXMUXIYRNH-UHFFFAOYSA-N
Data: 2 IC50
Activity Spreadsheet -- Enzyme Inhibition Constant Data from BindingDB
Found 2 hits for monomerid = 181223
Trg + Lig
Ki
nM
ΔG°
kcal/mole
IC50
nM
Kd
nM
EC50/IC50
nM
koff
s-1
kon
M-1s-1
pHTemp
°C
Sodium channel protein type 10 subunit alpha
(Homo sapiens (Human))
BDBM181223
(US9139529, 66 | US9783501, Compound 66)
Show SMILES NS(=O)(=O)c1cccc(NC(=O)c2cc3ccccc3nc2Oc2ccc(F)cc2Cl)c1
Show InChI InChI=1S/C22H15ClFN3O4S/c23-18-11-14(24)8-9-20(18)31-22-17(10-13-4-1-2-7-19(13)27-22)21(28)26-15-5-3-6-16(12-15)32(25,29)30/h1-12H,(H,26,28)(H2,25,29,30)
US Patent
n/an/a 2n/an/an/an/an/an/a
VERTEX PHARMACEUTICALS INCORPORATED
US Patent
Assay Description
Patch clamp electrophysiology was used to assess the efficacy and selectivity of sodium channel blockers in dorsal root ganglion neurons. Rat neurons...
US Patent US9783501 (2017)
BindingDB Entry DOI: 10.7270/Q25B04NS
Sodium channel protein type 10 subunit alpha
(Rattus norvegicus (Rat))
BDBM181223
(US9139529, 66 | US9783501, Compound 66)
Show SMILES NS(=O)(=O)c1cccc(NC(=O)c2cc3ccccc3nc2Oc2ccc(F)cc2Cl)c1
Show InChI InChI=1S/C22H15ClFN3O4S/c23-18-11-14(24)8-9-20(18)31-22-17(10-13-4-1-2-7-19(13)27-22)21(28)26-15-5-3-6-16(12-15)32(25,29)30/h1-12H,(H,26,28)(H2,25,29,30)
US Patent
n/an/a 2n/an/an/an/an/an/a
VERTEX PHARMACEUTICALS INCORPORATED
US Patent
Assay Description
Patch clamp electrophysiology was used to assess the efficacy and selectivity of sodium channel blockers in dorsal root ganglion neurons. Rat neurons...
US Patent US9139529 (2015)
BindingDB Entry DOI: 10.7270/Q2ZG6R1Z