BDBM181411 US9139577, 2.019::US9708274, 2.019
SMILES: C[C@@H](Oc1cc(F)ccc1Nc1ncnc2cc(cc(C)c12)N=S1(=O)CC[C@H](N)C1)C(=O)NCC(F)(F)F
InChI Key: InChIKey=UOFDWSKNTLYTJB-VOTVHCHESA-N
Data: 2 IC50
Activity Spreadsheet -- Enzyme Inhibition Constant Data from BindingDB
Found 2 hits for monomerid = 181411
Trg + Lig
Ki
nM
ΔG°
kcal/mole
IC50
nM
Kd
nM
EC50/IC50
nM
koff
s-1
kon
M-1s-1
pHTemp
°C
MAP kinase-interacting serine/threonine-protein kinase 2
(Homo sapiens (Human))
BDBM181411
(US9139577, 2.019 | US9708274, 2.019)
Show SMILES C[C@@H](Oc1cc(F)ccc1Nc1ncnc2cc(cc(C)c12)N=S1(=O)CC[C@H](N)C1)C(=O)NCC(F)(F)F |r|
Show InChI InChI=1S/C24H26F4N6O3S/c1-13-7-17(34-38(36)6-5-16(29)10-38)9-19-21(13)22(32-12-31-19)33-18-4-3-15(25)8-20(18)37-14(2)23(35)30-11-24(26,27)28/h3-4,7-9,12,14,16H,5-6,10-11,29H2,1-2H3,(H,30,35)(H,31,32,33)/t14-,16+,38?/m1/s1
US Patent
n/an/a 1n/an/an/an/an/a25
EVOTEC INTERNATIONAL GMBH
US Patent
Assay Description
The inhibition of kinase activity of MNK2a was assessed using pre-activated GST-MNK2a. The white, 384-well OptiPlate F plates were purchased from Per...
US Patent US9708274 (2017)
BindingDB Entry DOI: 10.7270/Q2VX0JJG
MAP kinase-interacting serine/threonine-protein kinase 2
(Homo sapiens (Human))
BDBM181411
(US9139577, 2.019 | US9708274, 2.019)
Show SMILES C[C@@H](Oc1cc(F)ccc1Nc1ncnc2cc(cc(C)c12)N=S1(=O)CC[C@H](N)C1)C(=O)NCC(F)(F)F |r|
Show InChI InChI=1S/C24H26F4N6O3S/c1-13-7-17(34-38(36)6-5-16(29)10-38)9-19-21(13)22(32-12-31-19)33-18-4-3-15(25)8-20(18)37-14(2)23(35)30-11-24(26,27)28/h3-4,7-9,12,14,16H,5-6,10-11,29H2,1-2H3,(H,30,35)(H,31,32,33)/t14-,16+,38?/m1/s1
US Patent
n/an/a 1n/an/an/an/an/an/a
Boehringer Ingelheim International GmbH
US Patent
Assay Description
The inhibition of kinase activity of MNK2a was assessed using pre-activated GST-MNK2a. The white, 384-well OptiPlate F plates were purchased from Per...
US Patent US9139577 (2015)
BindingDB Entry DOI: 10.7270/Q2K64GT1