BDBM181418 US9139577, 2.026::US9708274, 2.026
SMILES: C[C@@H](Oc1cc(F)ccc1Nc1ncnc2cc(cc(F)c12)N=S1(=O)CC(C)(C)C1)C(=O)NCC#N
InChI Key: InChIKey=GHLKJIPEDWCMTA-CQSZACIVSA-N
Data: 2 IC50
Activity Spreadsheet -- Enzyme Inhibition Constant Data from BindingDB
Found 2 hits for monomerid = 181418
Trg + Lig
Ki
nM
ΔG°
kcal/mole
IC50
nM
Kd
nM
EC50/IC50
nM
koff
s-1
kon
M-1s-1
pHTemp
°C
MAP kinase-interacting serine/threonine-protein kinase 2
(Homo sapiens (Human))
BDBM181418
(US9139577, 2.026 | US9708274, 2.026)
Show SMILES C[C@@H](Oc1cc(F)ccc1Nc1ncnc2cc(cc(F)c12)N=S1(=O)CC(C)(C)C1)C(=O)NCC#N |r|
Show InChI InChI=1S/C24H24F2N6O3S/c1-14(23(33)28-7-6-27)35-20-8-15(25)4-5-18(20)31-22-21-17(26)9-16(10-19(21)29-13-30-22)32-36(34)11-24(2,3)12-36/h4-5,8-10,13-14H,7,11-12H2,1-3H3,(H,28,33)(H,29,30,31)/t14-/m1/s1
US Patent
n/an/a 1n/an/an/an/an/a25
EVOTEC INTERNATIONAL GMBH
US Patent
Assay Description
The inhibition of kinase activity of MNK2a was assessed using pre-activated GST-MNK2a. The white, 384-well OptiPlate F plates were purchased from Per...
US Patent US9708274 (2017)
BindingDB Entry DOI: 10.7270/Q2VX0JJG
MAP kinase-interacting serine/threonine-protein kinase 2
(Homo sapiens (Human))
BDBM181418
(US9139577, 2.026 | US9708274, 2.026)
Show SMILES C[C@@H](Oc1cc(F)ccc1Nc1ncnc2cc(cc(F)c12)N=S1(=O)CC(C)(C)C1)C(=O)NCC#N |r|
Show InChI InChI=1S/C24H24F2N6O3S/c1-14(23(33)28-7-6-27)35-20-8-15(25)4-5-18(20)31-22-21-17(26)9-16(10-19(21)29-13-30-22)32-36(34)11-24(2,3)12-36/h4-5,8-10,13-14H,7,11-12H2,1-3H3,(H,28,33)(H,29,30,31)/t14-/m1/s1
US Patent
n/an/a 1n/an/an/an/an/an/a
Boehringer Ingelheim International GmbH
US Patent
Assay Description
The inhibition of kinase activity of MNK2a was assessed using pre-activated GST-MNK2a. The white, 384-well OptiPlate F plates were purchased from Per...
US Patent US9139577 (2015)
BindingDB Entry DOI: 10.7270/Q2K64GT1