null
SMILES: CCc1c2COC(=O)c2ccc1C(O)CN1CCN(CCc2ccc3C(=O)OCCc3c2)CC1
InChI Key: InChIKey=MVULABYFIZDRDL-UHFFFAOYSA-N
Activity Spreadsheet -- Enzyme Inhibition Constant Data from BindingDB
Found 1 hit for monomerid = 181741
Trg + Lig
Ki
nM
ΔG°
kcal/mole
IC50
nM
Kd
nM
EC50/IC50
nM
koff
s-1
kon
M-1s-1
pHTemp
°C
ATP-sensitive inward rectifier potassium channel 1
(Homo sapiens (Human))
BDBM181741
(US9139585, 32)
Show SMILES CCc1c2COC(=O)c2ccc1C(O)CN1CCN(CCc2ccc3C(=O)OCCc3c2)CC1
Show InChI InChI=1S/C27H32N2O5/c1-2-20-22(5-6-23-24(20)17-34-27(23)32)25(30)16-29-12-10-28(11-13-29)9-7-18-3-4-21-19(15-18)8-14-33-26(21)31/h3-6,15,25,30H,2,7-14,16-17H2,1H3
Reactome pathway
US Patent
n/an/a 46n/an/an/an/a7.437
Merck Sharp & Dohme Corp.
US Patent
Assay Description
Block of Kir1.1 (ROMK1) currents was examined by whole cell voltage clamp (Hamill et. al. Pfluegers Archives 391:85-100 (1981)) using the IonWorks Qu...
US Patent US9139585 (2015)
BindingDB Entry DOI: 10.7270/Q29P30F8