BDBM18187 4-[(1R,7R,7aR)-7-hydroxy-3-oxo-1-(propan-2-yl)-hexahydro-1H-pyrrolo[1,2-a]imidazolidin-2-yl]-2-chloro-3-methylbenzonitrile::imidazolin-2-one, 13
SMILES: [H][C@@]12[C@H](O)CCN1C(=O)N([C@@H]2C(C)C)c1ccc(C#N)c(Cl)c1C
InChI Key: InChIKey=RSDGTWFEQYRSGQ-BMFZPTHFSA-N
Data: 1 KI  1 EC50
Activity Spreadsheet -- Enzyme Inhibition Constant Data from BindingDB
Found 1 hit for monomerid = 18187
Trg + Lig
Ki
nM
ΔG°
kcal/mole
IC50
nM
Kd
nM
EC50/IC50
nM
koff
s-1
kon
M-1s-1
pHTemp
°C
Androgen Receptor
(Homo sapiens (Human))
BDBM18187
(4-[(1R,7R,7aR)-7-hydroxy-3-oxo-1-(propan-2-yl)-hex...)
Show SMILES [H][C@@]12[C@H](O)CCN1C(=O)N([C@@H]2C(C)C)c1ccc(C#N)c(Cl)c1C |r|
Show InChI InChI=1S/C17H20ClN3O2/c1-9(2)15-16-13(22)6-7-20(16)17(23)21(15)12-5-4-11(8-19)14(18)10(12)3/h4-5,9,13,15-16,22H,6-7H2,1-3H3/t13-,15-,16+/m1/s1
NCI pathway
Reactome pathway
23 -10.3n/an/a 108n/an/a7.422
Bristol-Myers Squibb Pharmaceutical Research Institute
Assay Description
Receptor Binding Assay (Ki)-Binding determined through direct displacement of ligand with [3H]-DHT in the MDA-453 cell line. Transactivation Assay (E...
J Med Chem 50: 3015-3025 (2007)
Article DOI: 10.1021/jm070312d
BindingDB Entry DOI: 10.7270/Q24F1P1F