BDBM182537 US9145392, 238
SMILES: Nc1ncnc(N2CCC(CC2)c2nc(cn2CCN2CCCC2)-c2ccc(F)c(F)c2)c1Cl
InChI Key: InChIKey=AJHYNXPIENOPCI-UHFFFAOYSA-N
Data: 2 IC50
Activity Spreadsheet -- Enzyme Inhibition Constant Data from BindingDB
Found 2 hits for monomerid = 182537
Trg + Lig
Ki
nM
ΔG°
kcal/mole
IC50
nM
Kd
nM
EC50/IC50
nM
koff
s-1
kon
M-1s-1
pHTemp
°C
RAC-alpha serine/threonine-protein kinase
(Homo sapiens (Human))
BDBM182537
(US9145392, 238)
Show SMILES Nc1ncnc(N2CCC(CC2)c2nc(cn2CCN2CCCC2)-c2ccc(F)c(F)c2)c1Cl
Show InChI InChI=1S/C24H28ClF2N7/c25-21-22(28)29-15-30-24(21)33-9-5-16(6-10-33)23-31-20(17-3-4-18(26)19(27)13-17)14-34(23)12-11-32-7-1-2-8-32/h3-4,13-16H,1-2,5-12H2,(H2,28,29,30)
US Patent
n/an/a 3.20n/an/an/an/a7.5n/a
Merck Patent GmbH
US Patent
Assay Description
A TTP Mosquito liquid handling instrument is used to place 125n1 of the appropriate concentration of inhibitor in 100% DMSO (for a dose response curv...
US Patent US9145392 (2015)
BindingDB Entry DOI: 10.7270/Q2NZ86D2
Ribosomal protein S6 kinase (P70S6K)
(Homo sapiens (Human))
BDBM182537
(US9145392, 238)
Show SMILES Nc1ncnc(N2CCC(CC2)c2nc(cn2CCN2CCCC2)-c2ccc(F)c(F)c2)c1Cl
Show InChI InChI=1S/C24H28ClF2N7/c25-21-22(28)29-15-30-24(21)33-9-5-16(6-10-33)23-31-20(17-3-4-18(26)19(27)13-17)14-34(23)12-11-32-7-1-2-8-32/h3-4,13-16H,1-2,5-12H2,(H2,28,29,30)
NCI pathway
Reactome pathway
US Patent
n/an/a 0.900n/an/an/an/a7.525
Merck Patent GmbH
US Patent
Assay Description
P70S6K inhibitor compounds are diluted and plated in 96 well plates. A reaction mixture including the following components is then added to the compo...
US Patent US9145392 (2015)
BindingDB Entry DOI: 10.7270/Q2NZ86D2