BDBM182539 US9145392, 240
SMILES: Nc1ncnc(N2CCC(CC2)c2nc(cn2CCN2CCCC2)-c2cccc(F)c2)c1C=C
InChI Key: InChIKey=USJIOUUNHSENIY-UHFFFAOYSA-N
Data: 2 IC50
Activity Spreadsheet -- Enzyme Inhibition Constant Data from BindingDB
Found 2 hits for monomerid = 182539
Trg + Lig
Ki
nM
ΔG°
kcal/mole
IC50
nM
Kd
nM
EC50/IC50
nM
koff
s-1
kon
M-1s-1
pHTemp
°C
RAC-alpha serine/threonine-protein kinase
(Homo sapiens (Human))
BDBM182539
(US9145392, 240)
Show SMILES Nc1ncnc(N2CCC(CC2)c2nc(cn2CCN2CCCC2)-c2cccc(F)c2)c1C=C
Show InChI InChI=1S/C26H32FN7/c1-2-22-24(28)29-18-30-26(22)33-12-8-19(9-13-33)25-31-23(20-6-5-7-21(27)16-20)17-34(25)15-14-32-10-3-4-11-32/h2,5-7,16-19H,1,3-4,8-15H2,(H2,28,29,30)
US Patent
n/an/a 21n/an/an/an/a7.5n/a
Merck Patent GmbH
US Patent
Assay Description
A TTP Mosquito liquid handling instrument is used to place 125n1 of the appropriate concentration of inhibitor in 100% DMSO (for a dose response curv...
US Patent US9145392 (2015)
BindingDB Entry DOI: 10.7270/Q2NZ86D2
Ribosomal protein S6 kinase (P70S6K)
(Homo sapiens (Human))
BDBM182539
(US9145392, 240)
Show SMILES Nc1ncnc(N2CCC(CC2)c2nc(cn2CCN2CCCC2)-c2cccc(F)c2)c1C=C
Show InChI InChI=1S/C26H32FN7/c1-2-22-24(28)29-18-30-26(22)33-12-8-19(9-13-33)25-31-23(20-6-5-7-21(27)16-20)17-34(25)15-14-32-10-3-4-11-32/h2,5-7,16-19H,1,3-4,8-15H2,(H2,28,29,30)
NCI pathway
Reactome pathway
US Patent
n/an/a 0.900n/an/an/an/a7.525
Merck Patent GmbH
US Patent
Assay Description
P70S6K inhibitor compounds are diluted and plated in 96 well plates. A reaction mixture including the following components is then added to the compo...
US Patent US9145392 (2015)
BindingDB Entry DOI: 10.7270/Q2NZ86D2