BDBM182602 US9145392, 303
SMILES: CCOc1c(N)ncnc1N1CCC(CC1)c1nc(cn1CCN(CC)CC)-c1ccc(F)c(C)c1
InChI Key: InChIKey=GYYUJPVOODOEGB-UHFFFAOYSA-N
Data: 2 IC50
Activity Spreadsheet -- Enzyme Inhibition Constant Data from BindingDB
Found 2 hits for monomerid = 182602
Trg + Lig
Ki
nM
ΔG°
kcal/mole
IC50
nM
Kd
nM
EC50/IC50
nM
koff
s-1
kon
M-1s-1
pHTemp
°C
RAC-alpha serine/threonine-protein kinase
(Homo sapiens (Human))
BDBM182602
(US9145392, 303)
Show SMILES CCOc1c(N)ncnc1N1CCC(CC1)c1nc(cn1CCN(CC)CC)-c1ccc(F)c(C)c1
Show InChI InChI=1S/C27H38FN7O/c1-5-33(6-2)14-15-35-17-23(21-8-9-22(28)19(4)16-21)32-26(35)20-10-12-34(13-11-20)27-24(36-7-3)25(29)30-18-31-27/h8-9,16-18,20H,5-7,10-15H2,1-4H3,(H2,29,30,31)
US Patent
n/an/a 0.800n/an/an/an/a7.5n/a
Merck Patent GmbH
US Patent
Assay Description
A TTP Mosquito liquid handling instrument is used to place 125n1 of the appropriate concentration of inhibitor in 100% DMSO (for a dose response curv...
US Patent US9145392 (2015)
BindingDB Entry DOI: 10.7270/Q2NZ86D2
Ribosomal protein S6 kinase (P70S6K)
(Homo sapiens (Human))
BDBM182602
(US9145392, 303)
Show SMILES CCOc1c(N)ncnc1N1CCC(CC1)c1nc(cn1CCN(CC)CC)-c1ccc(F)c(C)c1
Show InChI InChI=1S/C27H38FN7O/c1-5-33(6-2)14-15-35-17-23(21-8-9-22(28)19(4)16-21)32-26(35)20-10-12-34(13-11-20)27-24(36-7-3)25(29)30-18-31-27/h8-9,16-18,20H,5-7,10-15H2,1-4H3,(H2,29,30,31)
NCI pathway
Reactome pathway
US Patent
n/an/a 2.40n/an/an/an/a7.525
Merck Patent GmbH
US Patent
Assay Description
P70S6K inhibitor compounds are diluted and plated in 96 well plates. A reaction mixture including the following components is then added to the compo...
US Patent US9145392 (2015)
BindingDB Entry DOI: 10.7270/Q2NZ86D2