BDBM182820 US9145414, 316
SMILES: CCn1cc2ccc(Nc3nc(N[C@@H]4CCCCC[C@@H]4N)nnc3C(N)=O)cc2n1
InChI Key: InChIKey=DIMDKKKMLHGJDY-LSDHHAIUSA-N
Data: 1 IC50
Activity Spreadsheet -- Enzyme Inhibition Constant Data from BindingDB
Found 1 hit for monomerid = 182820
Trg + Lig
Ki
nM
ΔG°
kcal/mole
IC50
nM
Kd
nM
EC50/IC50
nM
koff
s-1
kon
M-1s-1
pHTemp
°C
Tyrosine-protein kinase SYK
(Homo sapiens (Human))
BDBM182820
(US9145414, 316)
Show SMILES CCn1cc2ccc(Nc3nc(N[C@@H]4CCCCC[C@@H]4N)nnc3C(N)=O)cc2n1 |r|
Show InChI InChI=1S/C20H27N9O/c1-2-29-11-12-8-9-13(10-16(12)28-29)23-19-17(18(22)30)26-27-20(25-19)24-15-7-5-3-4-6-14(15)21/h8-11,14-15H,2-7,21H2,1H3,(H2,22,30)(H2,23,24,25,27)/t14-,15+/m0/s1
NCI pathway
Reactome pathway
US Patent
n/an/a 0.310n/an/an/an/a7.525
TAIHO PHARMACEUTICAL CO., LTD.
US Patent
Assay Description
The in vitro inhibitory activity of the compound of the present invention against Syk kinase activity was assayed under the following conditions: the...
US Patent US9145414 (2015)
BindingDB Entry DOI: 10.7270/Q2513X18