null
SMILES: CC[C@H](Nc1ncnc2[nH]cnc12)c1nc2cccc(Cl)c2c(=O)n1-c1cc(F)cc(F)c1
InChI Key: InChIKey=TWLUHIZKDUPYPV-HNNXBMFYSA-N
Activity Spreadsheet -- Enzyme Inhibition Constant Data from BindingDB
Found 1 hit for monomerid = 182844
Trg + Lig
Ki
nM
ΔG°
kcal/mole
IC50
nM
Kd
nM
EC50/IC50
nM
koff
s-1
kon
M-1s-1
pHTemp
°C
Phosphatidylinositol 4,5-bisphosphate 3-kinase catalytic subunit delta isoform
(Homo sapiens (Human))
BDBM182844
(US9149477, Compound 117)
Show SMILES CC[C@H](Nc1ncnc2[nH]cnc12)c1nc2cccc(Cl)c2c(=O)n1-c1cc(F)cc(F)c1
Show InChI InChI=1S/C22H16ClF2N7O/c1-2-15(30-20-18-19(27-9-26-18)28-10-29-20)21-31-16-5-3-4-14(23)17(16)22(33)32(21)13-7-11(24)6-12(25)8-13/h3-10,15H,2H2,1H3,(H2,26,27,28,29,30)/t15-/m0/s1
NCI pathway
Reactome pathway
US Patent
n/an/a 12n/an/an/an/an/an/a
ICOS Corporation
US Patent
Assay Description
Using the method described in US9149477, Example 2, compounds of the invention were tested for inhibitory activity and potency against PI3Kδ, an...
US Patent US9149477 (2015)
BindingDB Entry DOI: 10.7270/Q2RR1X11