null
SMILES: CCC(Nc1ncnc2[nH]cnc12)c1nc2ccccc2c(=O)n1-c1ccccc1
InChI Key:
Activity Spreadsheet -- Enzyme Inhibition Constant Data from BindingDB
Found 1 hit for monomerid = 182845
Trg + Lig
Ki
nM
ΔG°
kcal/mole
IC50
nM
Kd
nM
EC50/IC50
nM
koff
s-1
kon
M-1s-1
pHTemp
°C
Phosphatidylinositol 4,5-bisphosphate 3-kinase catalytic subunit delta isoform
(Homo sapiens (Human))
BDBM182845
(US9149477, Compound 98)
Show SMILES CCC(Nc1ncnc2[nH]cnc12)c1nc2ccccc2c(=O)n1-c1ccccc1
NCI pathway
Reactome pathway
US Patent
n/an/a 16n/an/an/an/an/an/a
ICOS Corporation
US Patent
Assay Description
Using the method described in US9149477, Example 2, compounds of the invention were tested for inhibitory activity and potency against PI3Kδ, an...
US Patent US9149477 (2015)
BindingDB Entry DOI: 10.7270/Q2RR1X11