BDBM18289 (2R,4S,5S,7S)-5-amino-4-hydroxy-N-(4-hydroxybutyl)-7-{[4-methoxy-3-(3-methoxypropoxy)phenyl]methyl}-2,8-dimethylnonanamide::8-phenyl-octanecarboxamide peptidomimetic, 46
SMILES: COCCCOc1cc(C[C@@H](C[C@H](N)[C@@H](O)C[C@@H](C)C(=O)NCCCCO)C(C)C)ccc1OC
InChI Key: InChIKey=QUBJGXKEBUBAFN-KAMZKSLDSA-N
Data: 1 IC50
Activity Spreadsheet -- Enzyme Inhibition Constant Data from BindingDB
Found 1 hit for monomerid = 18289
Trg + Lig
Ki
nM
ΔG°
kcal/mole
IC50
nM
Kd
nM
EC50/IC50
nM
koff
s-1
kon
M-1s-1
pHTemp
°C
Renin
(Homo sapiens (Human))
BDBM18289
((2R,4S,5S,7S)-5-amino-4-hydroxy-N-(4-hydroxybutyl)...)
Show SMILES COCCCOc1cc(C[C@@H](C[C@H](N)[C@@H](O)C[C@@H](C)C(=O)NCCCCO)C(C)C)ccc1OC |r|
Show InChI InChI=1S/C27H48N2O6/c1-19(2)22(16-21-9-10-25(34-5)26(17-21)35-14-8-13-33-4)18-23(28)24(31)15-20(3)27(32)29-11-6-7-12-30/h9-10,17,19-20,22-24,30-31H,6-8,11-16,18,28H2,1-5H3,(H,29,32)/t20-,22+,23+,24+/m1/s1
Reactome pathway
n/an/a 0.800n/an/an/an/a7.237
Novartis Pharmaceuticals
Assay Description
Enzyme inhibition by test compounds was determined using human recombinant renin, incubating with a synthetic tetradecapeptide substrate. The Ang I g...
J Med Chem 50: 4818-31 (2007)
Article DOI: 10.1021/jm070314y
BindingDB Entry DOI: 10.7270/Q2MG7MSF
3D
3D Structure (docked)