BDBM183822 US9150526, 75
SMILES: COc1ccccc1-c1cc(Cl)cc(c1)C(CC(O)=O)c1ncc(C)s1
InChI Key: InChIKey=ANILTBVIJVCJJM-UHFFFAOYSA-N
Data: 1 IC50
Activity Spreadsheet -- Enzyme Inhibition Constant Data from BindingDB
Found 1 hit for monomerid = 183822
Trg + Lig
Ki
nM
ΔG°
kcal/mole
IC50
nM
Kd
nM
EC50/IC50
nM
koff
s-1
kon
M-1s-1
pHTemp
°C
Cathepsin A (CTSA)
(Homo sapiens (Human))
BDBM183822
(US9150526, 75)
Show SMILES COc1ccccc1-c1cc(Cl)cc(c1)C(CC(O)=O)c1ncc(C)s1
Show InChI InChI=1S/C20H18ClNO3S/c1-12-11-22-20(26-12)17(10-19(23)24)14-7-13(8-15(21)9-14)16-5-3-4-6-18(16)25-2/h3-9,11,17H,10H2,1-2H3,(H,23,24)
US Patent
n/an/a 21n/an/an/an/a6.037
Sanofi
US Patent
Assay Description
Recombinant human cathepsin A (residues 29-480, with a C-terminal 10-His tag; R&D Systems, #1049-SE) was proteolytically activated with recombinant h...
US Patent US9150526 (2015)
BindingDB Entry DOI: 10.7270/Q2QR4VXP