BDBM183843 US9150526, 96
SMILES: COc1cc(CO)cc(OC)c1-c1cc(F)cc(c1)C(CC(O)=O)c1ncco1
InChI Key: InChIKey=HZWWMBPSBWSSBN-UHFFFAOYSA-N
Data: 1 IC50
Activity Spreadsheet -- Enzyme Inhibition Constant Data from BindingDB
Found 1 hit for monomerid = 183843
Trg + Lig
Ki
nM
ΔG°
kcal/mole
IC50
nM
Kd
nM
EC50/IC50
nM
koff
s-1
kon
M-1s-1
pHTemp
°C
Cathepsin A (CTSA)
(Homo sapiens (Human))
BDBM183843
(US9150526, 96)
Show SMILES COc1cc(CO)cc(OC)c1-c1cc(F)cc(c1)C(CC(O)=O)c1ncco1
Show InChI InChI=1S/C21H20FNO6/c1-27-17-5-12(11-24)6-18(28-2)20(17)14-7-13(8-15(22)9-14)16(10-19(25)26)21-23-3-4-29-21/h3-9,16,24H,10-11H2,1-2H3,(H,25,26)
US Patent
n/an/a 14n/an/an/an/a6.037
Sanofi
US Patent
Assay Description
Recombinant human cathepsin A (residues 29-480, with a C-terminal 10-His tag; R&D Systems, #1049-SE) was proteolytically activated with recombinant h...
US Patent US9150526 (2015)
BindingDB Entry DOI: 10.7270/Q2QR4VXP