BDBM183901 US9150526, 154
SMILES: COc1cccc(OC)c1-c1cc(Cl)cc(c1)C(CC(O)=O)c1nnc(C)o1
InChI Key: InChIKey=CBBJLBWYZFKWIY-UHFFFAOYSA-N
Data: 1 IC50
Activity Spreadsheet -- Enzyme Inhibition Constant Data from BindingDB
Found 1 hit for monomerid = 183901
Trg + Lig
Ki
nM
ΔG°
kcal/mole
IC50
nM
Kd
nM
EC50/IC50
nM
koff
s-1
kon
M-1s-1
pHTemp
°C
Cathepsin A (CTSA)
(Homo sapiens (Human))
BDBM183901
(US9150526, 154)
Show SMILES COc1cccc(OC)c1-c1cc(Cl)cc(c1)C(CC(O)=O)c1nnc(C)o1
Show InChI InChI=1S/C20H19ClN2O5/c1-11-22-23-20(28-11)15(10-18(24)25)12-7-13(9-14(21)8-12)19-16(26-2)5-4-6-17(19)27-3/h4-9,15H,10H2,1-3H3,(H,24,25)
US Patent
n/an/a 5n/an/an/an/a6.037
Sanofi
US Patent
Assay Description
Recombinant human cathepsin A (residues 29-480, with a C-terminal 10-His tag; R&D Systems, #1049-SE) was proteolytically activated with recombinant h...
US Patent US9150526 (2015)
BindingDB Entry DOI: 10.7270/Q2QR4VXP