BDBM18417 (3R,5S)-6-({3-[(cyclohexylmethyl)(methyl)carbamoyl]-1-(4-fluorophenyl)-4-(propan-2-yl)-1H-pyrazol-5-yl}oxy)-3,5-dihydroxyhexanoic acid::oxypyrazole, 4dd
SMILES: CC(C)c1c(nn(c1OC[C@@H](O)C[C@@H](O)CC(O)=O)-c1ccc(F)cc1)C(=O)N(C)CC1CCCCC1
InChI Key: InChIKey=LEEKGUHBAWHKQS-YADHBBJMSA-N
Data: 1 IC50
Activity Spreadsheet -- Enzyme Inhibition Constant Data from BindingDB
Found 1 hit for monomerid = 18417
Trg + Lig
Ki
nM
ΔG°
kcal/mole
IC50
nM
Kd
nM
EC50/IC50
nM
koff
s-1
kon
M-1s-1
pHTemp
°C
HMG-CoA reductase
(Rattus norvegicus (rat))
BDBM18417
((3R,5S)-6-({3-[(cyclohexylmethyl)(methyl)carbamoyl...)
Show SMILES CC(C)c1c(nn(c1OC[C@@H](O)C[C@@H](O)CC(O)=O)-c1ccc(F)cc1)C(=O)N(C)CC1CCCCC1 |r|
Show InChI InChI=1S/C27H38FN3O6/c1-17(2)24-25(26(36)30(3)15-18-7-5-4-6-8-18)29-31(20-11-9-19(28)10-12-20)27(24)37-16-22(33)13-21(32)14-23(34)35/h9-12,17-18,21-22,32-33H,4-8,13-16H2,1-3H3,(H,34,35)/t21-,22+/m1/s1
Reactome pathway
n/an/a 6.20n/an/an/an/an/an/a
Pfizer
Assay Description
Assay for HMG-CoA reductase was based on the conversion of isotopically labeled HMG-CoA to mevalonic acid using rat liver microsomes as enzyme source...
Bioorg Med Chem Lett 17: 5567-72 (2007)
Article DOI: 10.1016/j.bmcl.2007.08.004
BindingDB Entry DOI: 10.7270/Q2ZS2TS7