BDBM184195 US9150577, 48
SMILES: CC1CCNC(=O)c2cc3ccc(cc3n12)C(=O)Nc1nc2cc(Cl)ccc2[nH]1
InChI Key:
Data: 1 IC50
Activity Spreadsheet -- Enzyme Inhibition Constant Data from BindingDB
Found 1 hit for monomerid = 184195
Trg + Lig
Ki
nM
ΔG°
kcal/mole
IC50
nM
Kd
nM
EC50/IC50
nM
koff
s-1
kon
M-1s-1
pHTemp
°C
Ribosomal protein S6 kinase alpha 2
(Homo sapiens (Human))
BDBM184195
(US9150577, 48)
Show SMILES CC1CCNC(=O)c2cc3ccc(cc3n12)C(=O)Nc1nc2cc(Cl)ccc2[nH]1
Reactome pathway
US Patent
n/an/a 2.5n/an/an/an/a7.5n/a
Boehringer Ingelheim International GmbH
US Patent
Assay Description
Human RSK2 protein, purchased from Invitrogen, is used to measure kinase activity utilizing Kinase Glo Plus (Promega) a homogeneous assay technology,...
US Patent US9150577 (2015)
BindingDB Entry DOI: 10.7270/Q2GB22V6