BDBM184230 BDBM184271::US9150577, 90
SMILES: C[C@H]1NC(=O)c2cc3ccc(cc3n2[C@H]1C)C(=O)Nc1nc2ccccc2n1CCCN(C)C
InChI Key: InChIKey=IQXDKRZFXZPPQO-SJORKVTESA-N
Data: 2 IC50
Activity Spreadsheet -- Enzyme Inhibition Constant Data from BindingDB
Found 2 hits for monomerid = 184230
Trg + Lig
Ki
nM
ΔG°
kcal/mole
IC50
nM
Kd
nM
EC50/IC50
nM
koff
s-1
kon
M-1s-1
pHTemp
°C
Ribosomal protein S6 kinase alpha 2
(Homo sapiens (Human))
BDBM184230
(BDBM184271 | US9150577, 90)
Show SMILES C[C@H]1NC(=O)c2cc3ccc(cc3n2[C@H]1C)C(=O)Nc1nc2ccccc2n1CCCN(C)C |r|
Show InChI InChI=1S/C26H30N6O2/c1-16-17(2)32-22-15-19(11-10-18(22)14-23(32)25(34)27-16)24(33)29-26-28-20-8-5-6-9-21(20)31(26)13-7-12-30(3)4/h5-6,8-11,14-17H,7,12-13H2,1-4H3,(H,27,34)(H,28,29,33)/t16-,17+/m1/s1
Reactome pathway
US Patent
n/an/a 13.7n/an/an/an/a7.5n/a
Boehringer Ingelheim International GmbH
US Patent
Assay Description
Human RSK2 protein, purchased from Invitrogen, is used to measure kinase activity utilizing Kinase Glo Plus (Promega) a homogeneous assay technology,...
US Patent US9150577 (2015)
BindingDB Entry DOI: 10.7270/Q2GB22V6
Ribosomal protein S6 kinase alpha 2
(Homo sapiens (Human))
BDBM184230
(BDBM184271 | US9150577, 90)
Show SMILES C[C@H]1NC(=O)c2cc3ccc(cc3n2[C@H]1C)C(=O)Nc1nc2ccccc2n1CCCN(C)C |r|
Show InChI InChI=1S/C26H30N6O2/c1-16-17(2)32-22-15-19(11-10-18(22)14-23(32)25(34)27-16)24(33)29-26-28-20-8-5-6-9-21(20)31(26)13-7-12-30(3)4/h5-6,8-11,14-17H,7,12-13H2,1-4H3,(H,27,34)(H,28,29,33)/t16-,17+/m1/s1
Reactome pathway
US Patent
n/an/a 2.10n/an/an/an/a7.5n/a
Boehringer Ingelheim International GmbH
US Patent
Assay Description
Human RSK2 protein, purchased from Invitrogen, is used to measure kinase activity utilizing Kinase Glo Plus (Promega) a homogeneous assay technology,...
US Patent US9150577 (2015)
BindingDB Entry DOI: 10.7270/Q2GB22V6