BDBM18435 Aminoquinoline compound, 20::N-[2-(diethylamino)-4-methylquinolin-6-yl]-4-methylcyclohexane-1-carboxamide
SMILES: CCN(CC)c1cc(C)c2cc(NC(=O)C3CCC(C)CC3)ccc2n1
InChI Key: InChIKey=PHNMAUWYEMWSDZ-UHFFFAOYSA-N
Data: 1 KI  1 IC50
Activity Spreadsheet -- Enzyme Inhibition Constant Data from BindingDB
Found 1 hit for monomerid = 18435
Trg + Lig
Ki
nM
ΔG°
kcal/mole
IC50
nM
Kd
nM
EC50/IC50
nM
koff
s-1
kon
M-1s-1
pHTemp
°C
Lysosomal acid glucosylceramidase
(Homo sapiens (Human))
BDBM18435
(Aminoquinoline compound, 20 | N-[2-(diethylamino)-...)
Show SMILES CCN(CC)c1cc(C)c2cc(NC(=O)C3CCC(C)CC3)ccc2n1 |(2.64,-.76,;1.31,.01,;1.31,1.55,;2.64,2.32,;3.98,1.55,;-.02,2.32,;-.02,3.86,;-1.36,4.63,;-1.36,6.17,;-2.69,3.86,;-4.03,4.63,;-5.36,3.86,;-6.69,4.63,;-8.03,3.86,;-8.03,2.32,;-9.36,4.63,;-9.46,6.17,;-10.84,6.85,;-12.12,6,;-13.5,6.68,;-12.02,4.46,;-10.64,3.78,;-5.36,2.32,;-4.03,1.55,;-2.69,2.32,;-1.36,1.55,)|
Show InChI InChI=1S/C22H31N3O/c1-5-25(6-2)21-13-16(4)19-14-18(11-12-20(19)24-21)23-22(26)17-9-7-15(3)8-10-17/h11-15,17H,5-10H2,1-4H3,(H,23,26)
Reactome pathway
514 -8.46 1.06E+3n/an/an/an/a5.921
NIH
Assay Description
Enzyme activity was determined as the production of fluorescent resorufin from the substrate. The fluorescence was measured (excitation 570 nm, emiss...
Proc Natl Acad Sci U S A 104: 13192-7 (2007)
Article DOI: 10.1073/pnas.0705637104
BindingDB Entry DOI: 10.7270/Q2V1232M