BDBM184566 US9150583, 3
SMILES: COc1cc(ccc1C(F)(F)F)[C@H]1OC2(CCOCC2)c2c1c(nc1CC3(CC3)C[C@H](O)c21)C(C)C
InChI Key: InChIKey=OZZDLODZCODVQC-UQBPGWFLSA-N
Data: 1 IC50
Activity Spreadsheet -- Enzyme Inhibition Constant Data from BindingDB
Found 1 hit for monomerid = 184566
Trg + Lig
Ki
nM
ΔG°
kcal/mole
IC50
nM
Kd
nM
EC50/IC50
nM
koff
s-1
kon
M-1s-1
pHTemp
°C
Cholesteryl ester transfer protein
(Homo sapiens (Human))
BDBM184566
(US9150583, 3)
Show SMILES COc1cc(ccc1C(F)(F)F)[C@H]1OC2(CCOCC2)c2c1c(nc1CC3(CC3)C[C@H](O)c21)C(C)C |r|
Show InChI InChI=1S/C28H32F3NO4/c1-15(2)24-22-23(21-18(32-24)13-26(6-7-26)14-19(21)33)27(8-10-35-11-9-27)36-25(22)16-4-5-17(28(29,30)31)20(12-16)34-3/h4-5,12,15,19,25,33H,6-11,13-14H2,1-3H3/t19-,25+/m0/s1
Reactome pathway
US Patent
n/an/a 11n/an/an/an/an/a37
Boehringer Ingelheim International GmbH
US Patent
Assay Description
CETP inhibitory activity of compounds of the present invention can be determined in a fluorometric assay purchased from Roar Biomedical, Inc. (New Yo...
US Patent US9150583 (2015)
BindingDB Entry DOI: 10.7270/Q2Z89B5V