BDBM185162 2-Naphthylmethyl 4-[2-(prop-2-enoylamino)acetyl]piperazine-1-carboxylate (3c)
SMILES: C=CC(=O)NCC(=O)N1CCN(CC1)C(=O)OCc1ccc2ccccc2c1
InChI Key: InChIKey=SIZKHLNOUXWIJL-UHFFFAOYSA-N
Data: 4 IC50
Activity Spreadsheet -- Enzyme Inhibition Constant Data from BindingDB
Found 4 hits for monomerid = 185162
Trg + Lig
Ki
nM
ΔG°
kcal/mole
IC50
nM
Kd
nM
EC50/IC50
nM
koff
s-1
kon
M-1s-1
pHTemp
°C
Protein-glutamine gamma-glutamyltransferase 2 (TG2)
(Homo sapiens (Human))
BDBM185162
(2-Naphthylmethyl 4-[2-(prop-2-enoylamino)acetyl]pi...)
Show SMILES C=CC(=O)NCC(=O)N1CCN(CC1)C(=O)OCc1ccc2ccccc2c1
Show InChI InChI=1S/C21H23N3O4/c1-2-19(25)22-14-20(26)23-9-11-24(12-10-23)21(27)28-15-16-7-8-17-5-3-4-6-18(17)13-16/h2-8,13H,1,9-12,14-15H2,(H,22,25)
n/an/a 440n/an/an/an/an/an/a
Aston University
Assay Description
For measurement of TG2 activity, the incorporation of biotinylated cadaverineinto immobilized N,N-dimethylcasein was used as described previously (Wa...
Chem Biol 22: 1347-61 (2015)
Article DOI: 10.1016/j.chembiol.2015.08.013
BindingDB Entry DOI: 10.7270/Q2222SJC
Coagulation factor XIII A (FXIIIa)
(Homo sapiens (Human))
BDBM185162
(2-Naphthylmethyl 4-[2-(prop-2-enoylamino)acetyl]pi...)
Show SMILES C=CC(=O)NCC(=O)N1CCN(CC1)C(=O)OCc1ccc2ccccc2c1
Show InChI InChI=1S/C21H23N3O4/c1-2-19(25)22-14-20(26)23-9-11-24(12-10-23)21(27)28-15-16-7-8-17-5-3-4-6-18(17)13-16/h2-8,13H,1,9-12,14-15H2,(H,22,25)
n/an/a>1.00E+5n/an/an/an/an/an/a
Aston University
Assay Description
For measurement of TG2 activity, the incorporation of biotinylated cadaverineinto immobilized N,N-dimethylcasein was used as described previously (Wa...
Chem Biol 22: 1347-61 (2015)
Article DOI: 10.1016/j.chembiol.2015.08.013
BindingDB Entry DOI: 10.7270/Q2222SJC
Transglutaminase-3 (TG3)
(Homo sapiens (Human))
BDBM185162
(2-Naphthylmethyl 4-[2-(prop-2-enoylamino)acetyl]pi...)
Show SMILES C=CC(=O)NCC(=O)N1CCN(CC1)C(=O)OCc1ccc2ccccc2c1
Show InChI InChI=1S/C21H23N3O4/c1-2-19(25)22-14-20(26)23-9-11-24(12-10-23)21(27)28-15-16-7-8-17-5-3-4-6-18(17)13-16/h2-8,13H,1,9-12,14-15H2,(H,22,25)
n/an/a>1.00E+5n/an/an/an/an/an/a
Aston University
Assay Description
For measurement of TG2 activity, the incorporation of biotinylated cadaverineinto immobilized N,N-dimethylcasein was used as described previously (Wa...
Chem Biol 22: 1347-61 (2015)
Article DOI: 10.1016/j.chembiol.2015.08.013
BindingDB Entry DOI: 10.7270/Q2222SJC
Transglutaminase-1 (TG1)
(Homo sapiens (Human))
BDBM185162
(2-Naphthylmethyl 4-[2-(prop-2-enoylamino)acetyl]pi...)
Show SMILES C=CC(=O)NCC(=O)N1CCN(CC1)C(=O)OCc1ccc2ccccc2c1
Show InChI InChI=1S/C21H23N3O4/c1-2-19(25)22-14-20(26)23-9-11-24(12-10-23)21(27)28-15-16-7-8-17-5-3-4-6-18(17)13-16/h2-8,13H,1,9-12,14-15H2,(H,22,25)
n/an/a>1.00E+5n/an/an/an/an/an/a
Aston University
Assay Description
For measurement of TG2 activity, the incorporation of biotinylated cadaverineinto immobilized N,N-dimethylcasein was used as described previously (Wa...
Chem Biol 22: 1347-61 (2015)
Article DOI: 10.1016/j.chembiol.2015.08.013
BindingDB Entry DOI: 10.7270/Q2222SJC