BDBM18528 6-(propan-2-ylamino)-4-(trifluoromethyl)-1,2-dihydroquinolin-2-one::6-dialkylamino-4-trifluoromethylquinolin-2(1H)-one, 4b
SMILES: CC(C)Nc1ccc2[nH]c(=O)cc(c2c1)C(F)(F)F
InChI Key: InChIKey=JJEZTPUKKJWQRO-UHFFFAOYSA-N
Data: 1 KI  1 IC50  1 EC50
Activity Spreadsheet -- Enzyme Inhibition Constant Data from BindingDB
Found 1 hit for monomerid = 18528
Trg + Lig
Ki
nM
ΔG°
kcal/mole
IC50
nM
Kd
nM
EC50/IC50
nM
koff
s-1
kon
M-1s-1
pHTemp
°C
Androgen Receptor
(Homo sapiens (Human))
BDBM18528
(6-(propan-2-ylamino)-4-(trifluoromethyl)-1,2-dihyd...)
Show SMILES CC(C)Nc1ccc2[nH]c(=O)cc(c2c1)C(F)(F)F
Show InChI InChI=1S/C13H13F3N2O/c1-7(2)17-8-3-4-11-9(5-8)10(13(14,15)16)6-12(19)18-11/h3-7,17H,1-2H3,(H,18,19)
NCI pathway
Reactome pathway
58 -10.3 16.5n/a 106n/an/a7.437
Ligand Pharmaceuticals Inc.
Assay Description
The compounds were evaluated in a transcriptional activation assay with hAR in a mammalian cell background (CV-1) as the primary in vitro assay. Rece...
J Med Chem 49: 6143-6 (2006)
Article DOI: 10.1021/jm060792t
BindingDB Entry DOI: 10.7270/Q26971VV