BDBM18532 6-(dibutylamino)-4-(trifluoromethyl)-1,2-dihydroquinolin-2-one::6-dialkylamino-4-trifluoromethylquinolin-2(1H)-one, 4f
SMILES: CCCCN(CCCC)c1ccc2[nH]c(=O)cc(c2c1)C(F)(F)F
InChI Key: InChIKey=GYHXZEJJZDZUEW-UHFFFAOYSA-N
Data: 1 KI  1 IC50  1 EC50
Activity Spreadsheet -- Enzyme Inhibition Constant Data from BindingDB
Found 1 hit for monomerid = 18532
Trg + Lig
Ki
nM
ΔG°
kcal/mole
IC50
nM
Kd
nM
EC50/IC50
nM
koff
s-1
kon
M-1s-1
pHTemp
°C
Androgen Receptor
(Homo sapiens (Human))
BDBM18532
(6-(dibutylamino)-4-(trifluoromethyl)-1,2-dihydroqu...)
Show SMILES CCCCN(CCCC)c1ccc2[nH]c(=O)cc(c2c1)C(F)(F)F
Show InChI InChI=1S/C18H23F3N2O/c1-3-5-9-23(10-6-4-2)13-7-8-16-14(11-13)15(18(19,20)21)12-17(24)22-16/h7-8,11-12H,3-6,9-10H2,1-2H3,(H,22,24)
NCI pathway
Reactome pathway
222 -9.44 29.5n/a 1.28E+3n/an/a7.437
Ligand Pharmaceuticals Inc.
Assay Description
The compounds were evaluated in a transcriptional activation assay with hAR in a mammalian cell background (CV-1) as the primary in vitro assay. Rece...
J Med Chem 49: 6143-6 (2006)
Article DOI: 10.1021/jm060792t
BindingDB Entry DOI: 10.7270/Q26971VV