BDBM18539 7-(propylamino)-4-(trifluoromethyl)-1,2-dihydroquinolin-2-one::alkylamino-2-quinolinone, 7
SMILES: CCCNc1ccc2c(cc(=O)[nH]c2c1)C(F)(F)F
InChI Key: InChIKey=UXSCCRZIYGFAND-UHFFFAOYSA-N
Data: 1 KI  1 IC50
Activity Spreadsheet -- Enzyme Inhibition Constant Data from BindingDB
Found 1 hit for monomerid = 18539
Trg + Lig
Ki
nM
ΔG°
kcal/mole
IC50
nM
Kd
nM
EC50/IC50
nM
koff
s-1
kon
M-1s-1
pHTemp
°C
Androgen Receptor
(Homo sapiens (Human))
BDBM18539
(7-(propylamino)-4-(trifluoromethyl)-1,2-dihydroqui...)
Show SMILES CCCNc1ccc2c(cc(=O)[nH]c2c1)C(F)(F)F
Show InChI InChI=1S/C13H13F3N2O/c1-2-5-17-8-3-4-9-10(13(14,15)16)7-12(19)18-11(9)6-8/h3-4,6-7,17H,2,5H2,1H3,(H,18,19)
NCI pathway
Reactome pathway
37 -10.5 32n/an/an/an/a7.437
Ligand Pharmaceuticals Inc.
Assay Description
The compounds were evaluated in a transcriptional activation assay with hAR in a mammalian cell background (CV-1) as the primary in vitro assay. Rece...
Bioorg Med Chem Lett 17: 1523-6 (2007)
Article DOI: 10.1016/j.bmcl.2007.01.007
BindingDB Entry DOI: 10.7270/Q22J6950