BDBM18541 7-(methylamino)-4-(trifluoromethyl)-1,2-dihydroquinolin-2-one::alkylamino-2-quinolinone, 9a
SMILES: CNc1ccc2c(cc(=O)[nH]c2c1)C(F)(F)F
InChI Key: InChIKey=VAHVDMYRASESOR-UHFFFAOYSA-N
Data: 1 KI  1 IC50
Activity Spreadsheet -- Enzyme Inhibition Constant Data from BindingDB
Found 1 hit for monomerid = 18541
Trg + Lig
Ki
nM
ΔG°
kcal/mole
IC50
nM
Kd
nM
EC50/IC50
nM
koff
s-1
kon
M-1s-1
pHTemp
°C
Androgen Receptor
(Homo sapiens (Human))
BDBM18541
(7-(methylamino)-4-(trifluoromethyl)-1,2-dihydroqui...)
Show SMILES CNc1ccc2c(cc(=O)[nH]c2c1)C(F)(F)F
Show InChI InChI=1S/C11H9F3N2O/c1-15-6-2-3-7-8(11(12,13)14)5-10(17)16-9(7)4-6/h2-5,15H,1H3,(H,16,17)
NCI pathway
Reactome pathway
83 -10.0 30n/an/an/an/a7.437
Ligand Pharmaceuticals Inc.
Assay Description
The compounds were evaluated in a transcriptional activation assay with hAR in a mammalian cell background (CV-1) as the primary in vitro assay. Rece...
Bioorg Med Chem Lett 17: 1523-6 (2007)
Article DOI: 10.1016/j.bmcl.2007.01.007
BindingDB Entry DOI: 10.7270/Q22J6950