BDBM18542 7-(ethylamino)-4-(trifluoromethyl)-1,2-dihydroquinolin-2-one::alkylamino-2-quinolinone, 9b
SMILES: CCNc1ccc2c(cc(=O)[nH]c2c1)C(F)(F)F
InChI Key: InChIKey=IRACJWZGMABLEC-UHFFFAOYSA-N
Data: 1 KI  1 IC50
Activity Spreadsheet -- Enzyme Inhibition Constant Data from BindingDB
Found 1 hit for monomerid = 18542
Trg + Lig
Ki
nM
ΔG°
kcal/mole
IC50
nM
Kd
nM
EC50/IC50
nM
koff
s-1
kon
M-1s-1
pHTemp
°C
Androgen receptor
(Homo sapiens (Human))
BDBM18542
(7-(ethylamino)-4-(trifluoromethyl)-1,2-dihydroquin...)
Show SMILES CCNc1ccc2c(cc(=O)[nH]c2c1)C(F)(F)F
Show InChI InChI=1S/C12H11F3N2O/c1-2-16-7-3-4-8-9(12(13,14)15)6-11(18)17-10(8)5-7/h3-6,16H,2H2,1H3,(H,17,18)
NCI pathway
Reactome pathway
29 -10.7 35n/an/an/an/a7.437
Ligand Pharmaceuticals Inc.
Assay Description
The compounds were evaluated in a transcriptional activation assay with hAR in a mammalian cell background (CV-1) as the primary in vitro assay. Rece...
Bioorg Med Chem Lett 17: 1523-6 (2007)
Article DOI: 10.1016/j.bmcl.2007.01.007
BindingDB Entry DOI: 10.7270/Q22J6950