BDBM18554 7-(benzylamino)-4-(trifluoromethyl)-1,2-dihydroquinolin-2-one::alkylamino-2-quinolinone, 9o
SMILES: FC(F)(F)c1cc(=O)[nH]c2cc(NCc3ccccc3)ccc12
InChI Key: InChIKey=APNBSJGIIWSWOI-UHFFFAOYSA-N
Data: 1 KI  1 IC50
Activity Spreadsheet -- Enzyme Inhibition Constant Data from BindingDB
Found 1 hit for monomerid = 18554
Trg + Lig
Ki
nM
ΔG°
kcal/mole
IC50
nM
Kd
nM
EC50/IC50
nM
koff
s-1
kon
M-1s-1
pHTemp
°C
Androgen Receptor
(Homo sapiens (Human))
BDBM18554
(7-(benzylamino)-4-(trifluoromethyl)-1,2-dihydroqui...)
Show SMILES FC(F)(F)c1cc(=O)[nH]c2cc(NCc3ccccc3)ccc12
Show InChI InChI=1S/C17H13F3N2O/c18-17(19,20)14-9-16(23)22-15-8-12(6-7-13(14)15)21-10-11-4-2-1-3-5-11/h1-9,21H,10H2,(H,22,23)
NCI pathway
Reactome pathway
163 -9.63 294n/an/an/an/a7.437
Ligand Pharmaceuticals Inc.
Assay Description
The compounds were evaluated in a transcriptional activation assay with hAR in a mammalian cell background (CV-1) as the primary in vitro assay. Rece...
Bioorg Med Chem Lett 17: 1523-6 (2007)
Article DOI: 10.1016/j.bmcl.2007.01.007
BindingDB Entry DOI: 10.7270/Q22J6950