null
SMILES: Clc1ccc(cc1)-c1ccccc1CN1CCN(CC1)c1ccc(cc1)C(=O)NS(=O)(=O)c1cccs1
InChI Key: InChIKey=ZWGWNUJGGOVHDH-UHFFFAOYSA-N
Activity Spreadsheet -- Enzyme Inhibition Constant Data from BindingDB
Found 2 hits for monomerid = 185609
Trg + Lig
Ki
nM
ΔG°
kcal/mole
IC50
nM
Kd
nM
EC50/IC50
nM
koff
s-1
kon
M-1s-1
pHTemp
°C
Apoptosis regulator Bcl-2/Glutathione S-transferase P
(Homo sapiens (Human))
BDBM185609
(US9156856, 19 | US9493431, 19)
Show SMILES Clc1ccc(cc1)-c1ccccc1CN1CCN(CC1)c1ccc(cc1)C(=O)NS(=O)(=O)c1cccs1
Show InChI InChI=1S/C28H26ClN3O3S2/c29-24-11-7-21(8-12-24)26-5-2-1-4-23(26)20-31-15-17-32(18-16-31)25-13-9-22(10-14-25)28(33)30-37(34,35)27-6-3-19-36-27/h1-14,19H,15-18,20H2,(H,30,33)
US Patent
234 -9.04n/an/an/an/an/an/a25
ABBVIE INC.
US Patent
Assay Description
Representative compounds were serially diluted in dimethyl sulfoxide (DMSO) starting at 50 uM (2x starting concentration; 10% DMSO) and 10 uL were tr...
US Patent US9493431 (2016)
BindingDB Entry DOI: 10.7270/Q2RB73HH
Bcl-2-like protein 1
(Homo sapiens (Human))
BDBM185609
(US9156856, 19 | US9493431, 19)
Show SMILES Clc1ccc(cc1)-c1ccccc1CN1CCN(CC1)c1ccc(cc1)C(=O)NS(=O)(=O)c1cccs1
Show InChI InChI=1S/C28H26ClN3O3S2/c29-24-11-7-21(8-12-24)26-5-2-1-4-23(26)20-31-15-17-32(18-16-31)25-13-9-22(10-14-25)28(33)30-37(34,35)27-6-3-19-36-27/h1-14,19H,15-18,20H2,(H,30,33)
NCI pathway
Reactome pathway
US Patent
234 -9.04n/an/an/an/an/an/a25
AbbVie Inc.
US Patent
Assay Description
Representative compounds were serially diluted in dimethyl sulfoxide (DMSO) starting at 50 μM (2× starting concentration; 10% DMSO) and 10 μ...
US Patent US9156856 (2015)
BindingDB Entry DOI: 10.7270/Q2125RFF