null
SMILES: [#6]-[#7](-[#6])-[#6]-[#6]-[#6@H](-[#6]-[#16]-c1ccccc1)-[#7]-c1sc(cc1-[#7+](-[#8-])=O)S(=O)(=O)[#7]-[#6](=O)-c1ccc(cc1)-[#7]-1-[#6]-[#6]\[#6](-[#6]-[#6]-1)=[#6]/c1ccccc1C(F)(F)F
InChI Key: InChIKey=FWRFSLAHLYNFLS-MUUNZHRXSA-N
Activity Spreadsheet -- Enzyme Inhibition Constant Data from BindingDB
Found 2 hits for monomerid = 185625
Trg + Lig
Ki
nM
ΔG°
kcal/mole
IC50
nM
Kd
nM
EC50/IC50
nM
koff
s-1
kon
M-1s-1
pHTemp
°C
Apoptosis regulator Bcl-2/Glutathione S-transferase P
(Homo sapiens (Human))
BDBM185625
(US9156856, 36 | US9493431, 36)
Show SMILES [#6]-[#7](-[#6])-[#6]-[#6]-[#6@H](-[#6]-[#16]-c1ccccc1)-[#7]-c1sc(cc1-[#7+](-[#8-])=O)S(=O)(=O)[#7]-[#6](=O)-c1ccc(cc1)-[#7]-1-[#6]-[#6]\[#6](-[#6]-[#6]-1)=[#6]/c1ccccc1C(F)(F)F
Show InChI InChI=1S/C36H38F3N5O5S3/c1-42(2)19-18-28(24-50-30-9-4-3-5-10-30)40-35-32(44(46)47)23-33(51-35)52(48,49)41-34(45)26-12-14-29(15-13-26)43-20-16-25(17-21-43)22-27-8-6-7-11-31(27)36(37,38)39/h3-15,22-23,28,40H,16-21,24H2,1-2H3,(H,41,45)/t28-/m1/s1
US Patent
294 -8.90n/an/an/an/an/an/a25
ABBVIE INC.
US Patent
Assay Description
Representative compounds were serially diluted in dimethyl sulfoxide (DMSO) starting at 50 uM (2x starting concentration; 10% DMSO) and 10 uL were tr...
US Patent US9493431 (2016)
BindingDB Entry DOI: 10.7270/Q2RB73HH
Bcl-2-like protein 1
(Homo sapiens (Human))
BDBM185625
(US9156856, 36 | US9493431, 36)
Show SMILES [#6]-[#7](-[#6])-[#6]-[#6]-[#6@H](-[#6]-[#16]-c1ccccc1)-[#7]-c1sc(cc1-[#7+](-[#8-])=O)S(=O)(=O)[#7]-[#6](=O)-c1ccc(cc1)-[#7]-1-[#6]-[#6]\[#6](-[#6]-[#6]-1)=[#6]/c1ccccc1C(F)(F)F
Show InChI InChI=1S/C36H38F3N5O5S3/c1-42(2)19-18-28(24-50-30-9-4-3-5-10-30)40-35-32(44(46)47)23-33(51-35)52(48,49)41-34(45)26-12-14-29(15-13-26)43-20-16-25(17-21-43)22-27-8-6-7-11-31(27)36(37,38)39/h3-15,22-23,28,40H,16-21,24H2,1-2H3,(H,41,45)/t28-/m1/s1
NCI pathway
Reactome pathway
US Patent
294 -8.90n/an/an/an/an/an/a25
AbbVie Inc.
US Patent
Assay Description
Representative compounds were serially diluted in dimethyl sulfoxide (DMSO) starting at 50 μM (2× starting concentration; 10% DMSO) and 10 μ...
US Patent US9156856 (2015)
BindingDB Entry DOI: 10.7270/Q2125RFF